BDBM87251 N-[2-[4-(2-keto-3H-benzimidazol-1-yl)-3,6-dihydro-2H-pyridin-1-yl]ethyl]-2,3-dihydronaphthalene-2-carboxamide;2,2,2-trifluoroacetic acid::N-[2-[4-(2-oxidanylidene-3H-benzimidazol-1-yl)-3,6-dihydro-2H-pyridin-1-yl]ethyl]-2,3-dihydronaphthalene-2-carboxamide;2,2,2-tris(fluoranyl)ethanoic acid::N-[2-[4-(2-oxo-3H-benzimidazol-1-yl)-3,6-dihydro-2H-pyridin-1-yl]ethyl]-2,3-dihydronaphthalene-2-carboxamide;2,2,2-trifluoroacetic acid::VU0462866-1::cid_53497782
SMILES O=C(NCCN1CCC(=CC1)n1c2ccccc2[nH]c1=O)C1CC=c2ccccc2=C1
InChI Key InChIKey=RBLNCZXQJYZPBW-UHFFFAOYSA-N
Data  2 IC50
  Tab Delimited (TSV)   2D SDfile   Computed 3D by Vconf -m prep SDfile
Find this compound or compounds like it in BindingDB:
Activity Spreadsheet -- Enzyme Inhibition Constant Data from BindingDB
Found 2 hits for monomerid = 87251
TargetPhospholipase D1(Homo sapiens (Human))
Vanderbilt Specialized Chemistry Center
Curated by PubChem BioAssay
LigandPNGBDBM87251(N-[2-[4-(2-keto-3H-benzimidazol-1-yl)-3,6-dihydro-...)
Affinity DataIC50:  130nM. Assay description: Phospholipase D (PLD) generates the lipid second messenger phosphatidic acid as part of a plethora of cellular functions. Phosphatidic acid (PtdOH) i...
Ligand InfoPC cidPC sid
In DepthDetails PCBioAssay
TargetPhospholipase D2(Homo sapiens (Human))
Vanderbilt Specialized Chemistry Center
Curated by PubChem BioAssay
LigandPNGBDBM87251(N-[2-[4-(2-keto-3H-benzimidazol-1-yl)-3,6-dihydro-...)
Affinity DataIC50:  680nM. Assay description: Phospholipase D (PLD) generates the lipid second messenger phosphatidic acid as part of a plethora of cellular functions. Phosphatidic acid (PtdOH) i...
Ligand InfoPC cidPC sid
In DepthDetails PCBioAssay