BDBM87305 MLS000660882::N'-[(1E)-(4,5-dibromothien-2-yl)methylene]isonicotinohydrazide::N-[(E)-(4,5-dibromo-2-thienyl)methyleneamino]isonicotinamide::N-[(E)-(4,5-dibromo-2-thiophenyl)methylideneamino]-4-pyridinecarboxamide::N-[(E)-(4,5-dibromothiophen-2-yl)methylideneamino]pyridine-4-carboxamide::N-[(E)-[4,5-bis(bromanyl)thiophen-2-yl]methylideneamino]pyridine-4-carboxamide::SMR000310520::cid_9682721
SMILES Brc1cc(\C=N\NC(=O)c2ccncc2)sc1Br
InChI Key InChIKey=FGVWQPVNYBYARX-GIDUJCDVSA-N
Data  3 IC50
  Tab Delimited (TSV)   2D SDfile   Computed 3D by Vconf -m prep SDfile
Find this compound or compounds like it in BindingDB:
Activity Spreadsheet -- Enzyme Inhibition Constant Data from BindingDB
Found 3 hits for monomerid = 87305
TargetNuclear receptor coactivator 3(Homo sapiens (Human))
The Scripps Research Institute Molecular Screening Center
Curated by PubChem BioAssay
LigandPNGBDBM87305(MLS000660882 | N'-[(1E)-(4,5-dibromothien-2-yl...)
Affinity DataIC50:  8.67E+3nM. Assay description: Source (MLPCN Center Name): The Scripps Research Institute Molecular Screening Center (SRIMSC) Affiliation: The Scripps Research Institute, TSRI Assa...
In DepthDetails PCBioAssay
TargetNuclear receptor coactivator 1(Homo sapiens (Human))
The Scripps Research Institute Molecular Screening Center
Curated by PubChem BioAssay
LigandPNGBDBM87305(MLS000660882 | N'-[(1E)-(4,5-dibromothien-2-yl...)
Affinity DataIC50:  1.37E+4nM. Assay description: Source (MLPCN Center Name): The Scripps Research Institute Molecular Screening Center (SRIMSC) Affiliation: The Scripps Research Institute, TSRI Assa...
In DepthDetails PCBioAssay
TargetTegument protein VP16(Human herpesvirus 1 (strain 17) (HHV-1) (Human her...)
The Scripps Research Institute Molecular Screening Center
Curated by PubChem BioAssay
LigandPNGBDBM87305(MLS000660882 | N'-[(1E)-(4,5-dibromothien-2-yl...)
Affinity DataIC50:  1.06E+4nM. Assay description: Source (MLPCN Center Name): The Scripps Research Institute Molecular Screening Center (SRIMSC) Affiliation: The Scripps Research Institute, TSRI Assa...
In DepthDetails PCBioAssay