BDBM87324 1-[(E)-(6-chloranyl-2,3-dihydrochromen-4-ylidene)amino]thiourea::2-(6-chloro-3,4-dihydro-2H-chromen-4-yliden)hydrazine-1-carbothioamide::MLS000862002::SMR000461084::[(E)-(6-chloro-2,3-dihydrochromen-4-ylidene)amino]thiourea::[(E)-(6-chloro-3,4-dihydro-2H-1-benzopyran-4-ylidene)amino]thiourea::[(E)-(6-chlorochroman-4-ylidene)amino]thiourea::cid_9580665
SMILES NC(=S)NN=C1CCOc2ccc(Cl)cc12
InChI Key InChIKey=KXIIIXKLZWIYAI-UHFFFAOYSA-N
Data  3 IC50
  Tab Delimited (TSV)   2D SDfile   Computed 3D by Vconf -m prep SDfile
Find this compound or compounds like it in BindingDB:
Activity Spreadsheet -- Enzyme Inhibition Constant Data from BindingDB
Found 3 hits for monomerid = 87324
TargetNuclear receptor coactivator 3(Homo sapiens (Human))
The Scripps Research Institute Molecular Screening Center
Curated by PubChem BioAssay
LigandPNGBDBM87324(1-[(E)-(6-chloranyl-2,3-dihydrochromen-4-ylidene)a...)
Affinity DataIC50:  6.90E+3nM. Assay description: Source (MLPCN Center Name): The Scripps Research Institute Molecular Screening Center (SRIMSC) Affiliation: The Scripps Research Institute, TSRI Assa...
In DepthDetails PCBioAssay
TargetNuclear receptor coactivator 1(Homo sapiens (Human))
The Scripps Research Institute Molecular Screening Center
Curated by PubChem BioAssay
LigandPNGBDBM87324(1-[(E)-(6-chloranyl-2,3-dihydrochromen-4-ylidene)a...)
Affinity DataIC50: >3.59E+4nM. Assay description: Source (MLPCN Center Name): The Scripps Research Institute Molecular Screening Center (SRIMSC) Affiliation: The Scripps Research Institute, TSRI Assa...
In DepthDetails PCBioAssay
TargetTegument protein VP16(Human herpesvirus 1 (strain 17) (HHV-1) (Human her...)
The Scripps Research Institute Molecular Screening Center
Curated by PubChem BioAssay
LigandPNGBDBM87324(1-[(E)-(6-chloranyl-2,3-dihydrochromen-4-ylidene)a...)
Affinity DataIC50:  1.34E+4nM. Assay description: Source (MLPCN Center Name): The Scripps Research Institute Molecular Screening Center (SRIMSC) Affiliation: The Scripps Research Institute, TSRI Assa...
In DepthDetails PCBioAssay