BDBM87388 2-(1H-benzimidazol-2-ylmethylsulfanyl)-5-methyl-1,3,4-thiadiazole::2-(1H-benzimidazol-2-ylmethylthio)-5-methyl-1,3,4-thiadiazole::MLS000036365::SMR000037009::cid_660900
SMILES Cc1nnc(SCc2nc3ccccc3[nH]2)s1
InChI Key InChIKey=BZBWORBUYWHIOY-UHFFFAOYSA-N
Data  1 IC50
  Tab Delimited (TSV)   2D SDfile   Computed 3D by Vconf -m prep SDfile
Find this compound or compounds like it in BindingDB:
Activity Spreadsheet -- Enzyme Inhibition Constant Data from BindingDB
Found 1 hit for monomerid = 87388
TargetTyrosine-protein kinase ABL1(Homo sapiens (Human))
The Scripps Research Institute Molecular Screening Center
Curated by PubChem BioAssay
LigandPNGBDBM87388(2-(1H-benzimidazol-2-ylmethylsulfanyl)-5-methyl-1,...)
Affinity DataIC50:  1.53E+4nM. Assay description: Source (MLPCN Center Name): The Scripps Research Institute Molecular Screening Center (SRIMSC) Affiliation: The Scripps Research Institute, TSRI Assa...
In DepthDetails PCBioAssay