BDBM87390 MLS000042591::N-(3-chlorophenyl)-2-(3-ketothiomorpholin-2-yl)acetamide::N-(3-chlorophenyl)-2-(3-oxidanylidenethiomorpholin-2-yl)ethanamide::N-(3-chlorophenyl)-2-(3-oxo-2-thiomorpholinyl)acetamide::N-(3-chlorophenyl)-2-(3-oxothiomorpholin-2-yl)acetamide::SMR000047743::cid_666338
SMILES Clc1cccc(NC(=O)CC2SCCNC2=O)c1
InChI Key InChIKey=NOVSTNSQVOXPFL-UHFFFAOYSA-N
Data  1 IC50
  Tab Delimited (TSV)   2D SDfile   Computed 3D by Vconf -m prep SDfile
Find this compound or compounds like it in BindingDB:
Activity Spreadsheet -- Enzyme Inhibition Constant Data from BindingDB
Found 1 hit for monomerid = 87390
TargetTyrosine-protein kinase ABL1(Homo sapiens (Human))
The Scripps Research Institute Molecular Screening Center
Curated by PubChem BioAssay
LigandPNGBDBM87390(MLS000042591 | N-(3-chlorophenyl)-2-(3-ketothiomor...)
Affinity DataIC50:  2.08E+4nM. Assay description: Source (MLPCN Center Name): The Scripps Research Institute Molecular Screening Center (SRIMSC) Affiliation: The Scripps Research Institute, TSRI Assa...
In DepthDetails PCBioAssay