BDBM87403 2-amino-6-[2-(4-methoxyphenyl)ethylamino]-1H-pyrimidin-4-one::2-amino-6-{[2-(4-methoxyphenyl)ethyl]amino}-4(3H)-pyrimidinone::2-azanyl-6-[2-(4-methoxyphenyl)ethylamino]-1H-pyrimidin-4-one::MLS000064690::SMR000077464::cid_1532134
SMILES COc1ccc(CCNc2cc(=O)[nH]c(N)n2)cc1
InChI Key InChIKey=NGPGNZOMBBGPNW-UHFFFAOYSA-N
Data  1 IC50
  Tab Delimited (TSV)   2D SDfile   Computed 3D by Vconf -m prep SDfile
Find this compound or compounds like it in BindingDB:
Activity Spreadsheet -- Enzyme Inhibition Constant Data from BindingDB
Found 1 hit for monomerid = 87403
TargetTyrosine-protein kinase ABL1(Homo sapiens (Human))
The Scripps Research Institute Molecular Screening Center
Curated by PubChem BioAssay
LigandPNGBDBM87403(2-amino-6-[2-(4-methoxyphenyl)ethylamino]-1H-pyrim...)
Affinity DataIC50:  5.15E+3nM. Assay description: Source (MLPCN Center Name): The Scripps Research Institute Molecular Screening Center (SRIMSC) Affiliation: The Scripps Research Institute, TSRI Assa...
In DepthDetails PCBioAssay