BDBM87425 2-[(3,5-dichloro-4-ethoxy-benzoyl)amino]benzoic acid::2-[(3,5-dichloro-4-ethoxybenzoyl)amino]benzoic acid::2-[[(3,5-dichloro-4-ethoxyphenyl)-oxomethyl]amino]benzoic acid::2-[[3,5-bis(chloranyl)-4-ethoxy-phenyl]carbonylamino]benzoic acid::MLS000576337::SMR000197977::cid_1295868
SMILES CCOc1c(Cl)cc(cc1Cl)C(=O)Nc1ccccc1C(O)=O
InChI Key InChIKey=FHFFZQVWNMAMDH-UHFFFAOYSA-N
Data  1 IC50
  Tab Delimited (TSV)   2D SDfile   Computed 3D by Vconf -m prep SDfile
Find this compound or compounds like it in BindingDB:
Activity Spreadsheet -- Enzyme Inhibition Constant Data from BindingDB
Found 1 hit for monomerid = 87425
TargetTyrosine-protein kinase ABL1(Homo sapiens (Human))
The Scripps Research Institute Molecular Screening Center
Curated by PubChem BioAssay
LigandPNGBDBM87425(2-[(3,5-dichloro-4-ethoxy-benzoyl)amino]benzoic ac...)
Affinity DataIC50:  2.68E+4nM. Assay description: Source (MLPCN Center Name): The Scripps Research Institute Molecular Screening Center (SRIMSC) Affiliation: The Scripps Research Institute, TSRI Assa...
In DepthDetails PCBioAssay