BDBM87449 MLS000686221::N-[(2-methoxyphenyl)methyl]-2-[(6-pyridin-3-yl-[1,2,4]triazolo[4,3-b]pyridazin-3-yl)sulfanyl]acetamide::N-[(2-methoxyphenyl)methyl]-2-[(6-pyridin-3-yl-[1,2,4]triazolo[4,3-b]pyridazin-3-yl)sulfanyl]ethanamide::N-[(2-methoxyphenyl)methyl]-2-[[6-(3-pyridinyl)-[1,2,4]triazolo[4,3-b]pyridazin-3-yl]thio]acetamide::N-o-anisyl-2-[[6-(3-pyridyl)-[1,2,4]triazolo[4,3-b]pyridazin-3-yl]thio]acetamide::SMR000324247::cid_7532071
SMILES COc1ccccc1CNC(=O)CSc1nnc2ccc(nn12)-c1cccnc1
InChI Key InChIKey=AHUHVSXXCQBOPZ-UHFFFAOYSA-N
Data  1 IC50
  Tab Delimited (TSV)   2D SDfile   Computed 3D by Vconf -m prep SDfile
Find this compound or compounds like it in BindingDB:
Activity Spreadsheet -- Enzyme Inhibition Constant Data from BindingDB
Found 1 hit for monomerid = 87449
TargetTyrosine-protein kinase ABL1(Homo sapiens (Human))
The Scripps Research Institute Molecular Screening Center
Curated by PubChem BioAssay
LigandPNGBDBM87449(MLS000686221 | N-[(2-methoxyphenyl)methyl]-2-[(6-p...)
Affinity DataIC50: >7.35E+4nM. Assay description: Source (MLPCN Center Name): The Scripps Research Institute Molecular Screening Center (SRIMSC) Affiliation: The Scripps Research Institute, TSRI Assa...
In DepthDetails PCBioAssay