BDBM87451 (Pyridin-2-ylsulfanyl)-acetic acid [1-(4-isopropoxy-3-methoxy-phenyl)-meth-(E)-ylidene]-hydrazide::MLS000780170::N-[(E)-(3-methoxy-4-propan-2-yloxy-phenyl)methylideneamino]-2-pyridin-2-ylsulfanyl-ethanamide::N-[(E)-(3-methoxy-4-propan-2-yloxyphenyl)methylideneamino]-2-(2-pyridinylthio)acetamide::N-[(E)-(3-methoxy-4-propan-2-yloxyphenyl)methylideneamino]-2-pyridin-2-ylsulfanylacetamide::N-[(E)-(4-isopropoxy-3-methoxy-benzylidene)amino]-2-(2-pyridylthio)acetamide::SMR000420353::cid_6884719
SMILES COc1cc(\C=N\NC(=O)CSc2ccccn2)ccc1OC(C)C
InChI Key InChIKey=ZRBVRNAACVXKKM-RGVLZGJSSA-N
Data  1 IC50
  Tab Delimited (TSV)   2D SDfile   Computed 3D by Vconf -m prep SDfile
Find this compound or compounds like it in BindingDB:
Activity Spreadsheet -- Enzyme Inhibition Constant Data from BindingDB
Found 1 hit for monomerid = 87451
TargetTyrosine-protein kinase ABL1(Homo sapiens (Human))
The Scripps Research Institute Molecular Screening Center
Curated by PubChem BioAssay
LigandPNGBDBM87451((Pyridin-2-ylsulfanyl)-acetic acid [1-(4-isopropox...)
Affinity DataIC50:  1.91E+4nM. Assay description: Source (MLPCN Center Name): The Scripps Research Institute Molecular Screening Center (SRIMSC) Affiliation: The Scripps Research Institute, TSRI Assa...
In DepthDetails PCBioAssay