BDBM87456 2-amino-4-(butylthio)-1H-pyrimidin-6-one::2-amino-4-butylsulfanyl-1H-pyrimidin-6-one::2-azanyl-4-butylsulfanyl-1H-pyrimidin-6-one::MLS000737036::SMR000393992::cid_237637
SMILES CCCCSc1cc(=O)[nH]c(N)n1
InChI Key InChIKey=NQOJODYDJOKULT-UHFFFAOYSA-N
Data  1 IC50
  Tab Delimited (TSV)   2D SDfile   Computed 3D by Vconf -m prep SDfile
Find this compound or compounds like it in BindingDB:
Activity Spreadsheet -- Enzyme Inhibition Constant Data from BindingDB
Found 1 hit for monomerid = 87456
TargetTyrosine-protein kinase ABL1(Homo sapiens (Human))
The Scripps Research Institute Molecular Screening Center
Curated by PubChem BioAssay
LigandPNGBDBM87456(2-amino-4-(butylthio)-1H-pyrimidin-6-one | 2-amino...)
Affinity DataIC50:  2.22E+4nM. Assay description: Source (MLPCN Center Name): The Scripps Research Institute Molecular Screening Center (SRIMSC) Affiliation: The Scripps Research Institute, TSRI Assa...
In DepthDetails PCBioAssay