BDBM87486 5-(1-azepanylsulfonyl)-N-[4-[diethylamino(oxo)methyl]phenyl]-2-methoxybenzamide::5-(azepan-1-ylsulfonyl)-N-[4-(diethylcarbamoyl)phenyl]-2-methoxy-benzamide::5-(azepan-1-ylsulfonyl)-N-[4-(diethylcarbamoyl)phenyl]-2-methoxybenzamide::MLS001078434::SMR000707798::cid_24686095
SMILES CCN(CC)C(=O)c1ccc(NC(=O)c2cc(ccc2OC)S(=O)(=O)N2CCCCCC2)cc1
InChI Key InChIKey=YLSYLYPVUUNVJN-UHFFFAOYSA-N
Data  1 IC50
  Tab Delimited (TSV)   2D SDfile   Computed 3D by Vconf -m prep SDfile
Find this compound or compounds like it in BindingDB:
Activity Spreadsheet -- Enzyme Inhibition Constant Data from BindingDB
Found 1 hit for monomerid = 87486
TargetTyrosine-protein kinase ABL1(Homo sapiens (Human))
The Scripps Research Institute Molecular Screening Center
Curated by PubChem BioAssay
LigandPNGBDBM87486(5-(1-azepanylsulfonyl)-N-[4-[diethylamino(oxo)meth...)
Affinity DataIC50:  618nM. Assay description: Source (MLPCN Center Name): The Scripps Research Institute Molecular Screening Center (SRIMSC) Affiliation: The Scripps Research Institute, TSRI Assa...
In DepthDetails PCBioAssay