BDBM87514 MLS002582693::N'-(2,2-Dimethyl-5-morpholin-4-yl-1,4-dihydro-2H-3,7-dithia-6,9,11-triaza-benzo[c]fluoren-8-yl)-N,N-dim ethyl-ethane-1,2-diamine::SMR000148194::cid_3732364
SMILES CN(C)CCNc1ncnc2c1sc1nc(N3CCOCC3)c3CSC(C)(C)Cc3c21
InChI Key InChIKey=MSUHRVPCQMHEDS-UHFFFAOYSA-N
Data  1 IC50
  Tab Delimited (TSV)   2D SDfile   Computed 3D by Vconf -m prep SDfile
Find this compound or compounds like it in BindingDB:
Activity Spreadsheet -- Enzyme Inhibition Constant Data from BindingDB
Found 1 hit for monomerid = 87514
TargetTyrosine-protein kinase ABL1(Homo sapiens (Human))
The Scripps Research Institute Molecular Screening Center
Curated by PubChem BioAssay
LigandPNGBDBM87514(MLS002582693 | N'-(2,2-Dimethyl-5-morpholin-4-...)
Affinity DataIC50:  1.37E+4nM. Assay description: Source (MLPCN Center Name): The Scripps Research Institute Molecular Screening Center (SRIMSC) Affiliation: The Scripps Research Institute, TSRI Assa...
In DepthDetails PCBioAssay