BDBM87528 1-benzoyl-N-[3-[2-[4-[[cyclopropyl(methyl)amino]-oxomethyl]anilino]-2-oxoethyl]phenyl]-4-piperidinecarboxamide::1-benzoyl-N-[3-[2-[4-[cyclopropyl(methyl)carbamoyl]anilino]-2-keto-ethyl]phenyl]isonipecotamide::1-benzoyl-N-[3-[2-[4-[cyclopropyl(methyl)carbamoyl]anilino]-2-oxoethyl]phenyl]piperidine-4-carboxamide::MLS002698790::N-[3-[2-[[4-[cyclopropyl(methyl)carbamoyl]phenyl]amino]-2-oxidanylidene-ethyl]phenyl]-1-(phenylcarbonyl)piperidine-4-carboxamide::SMR001562916::cid_44825696
SMILES CN(C1CC1)C(=O)c1ccc(NC(=O)Cc2cccc(NC(=O)C3CCN(CC3)C(=O)c3ccccc3)c2)cc1
InChI Key InChIKey=IJWHBIZTVLCZKM-UHFFFAOYSA-N
Data  1 IC50
  Tab Delimited (TSV)   2D SDfile   Computed 3D by Vconf -m prep SDfile
Find this compound or compounds like it in BindingDB:
Activity Spreadsheet -- Enzyme Inhibition Constant Data from BindingDB
Found 1 hit for monomerid = 87528
TargetTyrosine-protein kinase ABL1(Homo sapiens (Human))
The Scripps Research Institute Molecular Screening Center
Curated by PubChem BioAssay
LigandPNGBDBM87528(1-benzoyl-N-[3-[2-[4-[[cyclopropyl(methyl)amino]-o...)
Affinity DataIC50:  1.53E+4nM. Assay description: Source (MLPCN Center Name): The Scripps Research Institute Molecular Screening Center (SRIMSC) Affiliation: The Scripps Research Institute, TSRI Assa...
In DepthDetails PCBioAssay