BDBM87567 MLS001234266::SMR000811639::[4-(6-fluoranyl-1,3-benzothiazol-2-yl)piperazin-1-yl]-(5-nitrofuran-2-yl)methanone::[4-(6-fluoro-1,3-benzothiazol-2-yl)-1-piperazinyl]-(5-nitro-2-furanyl)methanone::[4-(6-fluoro-1,3-benzothiazol-2-yl)piperazin-1-yl]-(5-nitrofuran-2-yl)methanone::[4-(6-fluoro-1,3-benzothiazol-2-yl)piperazino]-(5-nitro-2-furyl)methanone::cid_7539130
SMILES [O-][N+](=O)c1ccc(o1)C(=O)N1CCN(CC1)c1nc2ccc(F)cc2s1
InChI Key InChIKey=GFTSBSZENZHFKB-UHFFFAOYSA-N
Data  2 EC50
  Tab Delimited (TSV)   2D SDfile   Computed 3D by Vconf -m prep SDfile
Find this compound or compounds like it in BindingDB:
Activity Spreadsheet -- Enzyme Inhibition Constant Data from BindingDB
Found 2 hits for monomerid = 87567
TargetV-type proton ATPase subunit c'(Saccharomyces cerevisiae S288c)
Nmmlsc
Curated by PubChem BioAssay
LigandPNGBDBM87567(MLS001234266 | SMR000811639 | [4-(6-fluoranyl-1,3-...)
Affinity DataEC50:  384nM. Assay description: University of New Mexico Assay Overview: Assay Support: 1 R03 DA031666-01A1 Project Title: Flow Cytometry HTS of Small Molecules that Regulate V-ATPa...
In DepthDetails PCBioAssay
TargetV-type proton ATPase subunit c'(Saccharomyces cerevisiae S288c)
Nmmlsc
Curated by PubChem BioAssay
LigandPNGBDBM87567(MLS001234266 | SMR000811639 | [4-(6-fluoranyl-1,3-...)
Affinity DataEC50:  3.64E+3nM. Assay description: University of New Mexico Assay Overview: Assay Support: 1 R03 DA031666-01A1 Project Title: Flow Cytometry HTS of Small Molecules that Regulate V-ATPa...
In DepthDetails PCBioAssay