BDBM87630 1-(2-methoxyethyl)-3-(phenylsulfonyl)-2H-imidazo[4,5-b]quinoxaline::3-(benzenesulfonyl)-1-(2-methoxyethyl)-2H-imidazo[4,5-b]quinoxaline::3-besyl-1-(2-methoxyethyl)-2H-imidazo[4,5-b]quinoxaline::MLS000041355::SMR000045837::cid_664837
SMILES COCCN1CN(c2nc3ccccc3nc12)S(=O)(=O)c1ccccc1
InChI Key InChIKey=MCQFAYHMZZGJOB-UHFFFAOYSA-N
Data  2 IC50
  Tab Delimited (TSV)   2D SDfile   Computed 3D by Vconf -m prep SDfile
Find this compound or compounds like it in BindingDB:
Activity Spreadsheet -- Enzyme Inhibition Constant Data from BindingDB
Found 2 hits for monomerid = 87630
TargetPolyadenylate-binding protein 1(Homo sapiens (Human))
Burnham Center For Chemical Genomics
Curated by PubChem BioAssay
LigandPNGBDBM87630(1-(2-methoxyethyl)-3-(phenylsulfonyl)-2H-imidazo[4...)
Affinity DataIC50: >6.60E+4nM. Assay description: Data Source: Sanford-Burnham Center for Chemical Genomics (SBCCG) Source Affiliation: Sanford-Burnham Medical Research Institute (SBMRI, San Diego, C...
In DepthDetails PCBioAssay
TargetPolyadenylate-binding protein 1(Homo sapiens (Human))
Burnham Center For Chemical Genomics
Curated by PubChem BioAssay
LigandPNGBDBM87630(1-(2-methoxyethyl)-3-(phenylsulfonyl)-2H-imidazo[4...)
Affinity DataIC50:  5.54E+4nM. Assay description: Data Source: Sanford-Burnham Center for Chemical Genomics (SBCCG) Source Affiliation: Sanford-Burnham Medical Research Institute (SBMRI, San Diego, C...
In DepthDetails PCBioAssay