BDBM87650 MLS000048928::N-(2-furanylmethyl)-2-(4-quinazolinylthio)acetamide::N-(2-furfuryl)-2-(quinazolin-4-ylthio)acetamide::N-(furan-2-ylmethyl)-2-quinazolin-4-ylsulfanyl-ethanamide::N-(furan-2-ylmethyl)-2-quinazolin-4-ylsulfanylacetamide::SMR000061736::cid_2396077
SMILES O=C(CSc1ncnc2ccccc12)NCc1ccco1
InChI Key InChIKey=OPWCBBCTBKTILK-UHFFFAOYSA-N
Data  3 IC50
  Tab Delimited (TSV)   2D SDfile   Computed 3D by Vconf -m prep SDfile
Find this compound or compounds like it in BindingDB:
Activity Spreadsheet -- Enzyme Inhibition Constant Data from BindingDB
Found 3 hits for monomerid = 87650
TargetPolyadenylate-binding protein 1(Homo sapiens (Human))
Burnham Center For Chemical Genomics
Curated by PubChem BioAssay
LigandPNGBDBM87650(MLS000048928 | N-(2-furanylmethyl)-2-(4-quinazolin...)
Affinity DataIC50: >6.60E+4nM. Assay description: Data Source: Sanford-Burnham Center for Chemical Genomics (SBCCG) Source Affiliation: Sanford-Burnham Medical Research Institute (SBMRI, San Diego, C...
In DepthDetails PCBioAssay
TargetMajor prion protein(Homo sapiens (Human))
The Scripps Research Institute Molecular Screening Center
Curated by PubChem BioAssay
LigandPNGBDBM87650(MLS000048928 | N-(2-furanylmethyl)-2-(4-quinazolin...)
Affinity DataIC50:  6.83E+3nM. Assay description: Source (MLPCN Center Name): The Scripps Research Institute Molecular Screening Center (SRIMSC) Affiliation: The Scripps Research Institute, TSRI Assa...
In DepthDetails PCBioAssay
TargetPolyadenylate-binding protein 1(Homo sapiens (Human))
Burnham Center For Chemical Genomics
Curated by PubChem BioAssay
LigandPNGBDBM87650(MLS000048928 | N-(2-furanylmethyl)-2-(4-quinazolin...)
Affinity DataIC50: >6.60E+4nM. Assay description: Data Source: Sanford-Burnham Center for Chemical Genomics (SBCCG) Source Affiliation: Sanford-Burnham Medical Research Institute (SBMRI, San Diego, C...
In DepthDetails PCBioAssay