BDBM87653 5-[(5,7-dimethyl-2-imidazo[1,2-a]pyrimidinyl)methylthio]-1,3,4-thiadiazol-2-amine::5-[(5,7-dimethylimidazo[1,2-a]pyrimidin-2-yl)methylsulfanyl]-1,3,4-thiadiazol-2-amine::MLS000060596::SMR000061530::[5-[(5,7-dimethylimidazo[1,2-a]pyrimidin-2-yl)methylthio]-1,3,4-thiadiazol-2-yl]amine::cid_3000019
SMILES Cc1cc(C)n2cc(CSc3nnc(N)s3)nc2n1
InChI Key InChIKey=RTMKDBJJKRGOIO-UHFFFAOYSA-N
Data  2 IC50
  Tab Delimited (TSV)   2D SDfile   Computed 3D by Vconf -m prep SDfile
Find this compound or compounds like it in BindingDB:
Activity Spreadsheet -- Enzyme Inhibition Constant Data from BindingDB
Found 2 hits for monomerid = 87653
TargetPolyadenylate-binding protein 1(Homo sapiens (Human))
Burnham Center For Chemical Genomics
Curated by PubChem BioAssay
LigandPNGBDBM87653(5-[(5,7-dimethyl-2-imidazo[1,2-a]pyrimidinyl)methy...)
Affinity DataIC50: >6.60E+4nM. Assay description: Data Source: Sanford-Burnham Center for Chemical Genomics (SBCCG) Source Affiliation: Sanford-Burnham Medical Research Institute (SBMRI, San Diego, C...
In DepthDetails PCBioAssay
TargetPolyadenylate-binding protein 1(Homo sapiens (Human))
Burnham Center For Chemical Genomics
Curated by PubChem BioAssay
LigandPNGBDBM87653(5-[(5,7-dimethyl-2-imidazo[1,2-a]pyrimidinyl)methy...)
Affinity DataIC50: >6.60E+4nM. Assay description: Data Source: Sanford-Burnham Center for Chemical Genomics (SBCCG) Source Affiliation: Sanford-Burnham Medical Research Institute (SBMRI, San Diego, C...
In DepthDetails PCBioAssay