BDBM87695 MLS000050605::N-(2,3-dihydro-1,4-benzodioxin-6-yl)-2-[(1-phenyl-1,2,4-triazol-3-yl)sulfanyl]acetamide::N-(2,3-dihydro-1,4-benzodioxin-6-yl)-2-[(1-phenyl-1,2,4-triazol-3-yl)sulfanyl]ethanamide::N-(2,3-dihydro-1,4-benzodioxin-6-yl)-2-[(1-phenyl-1,2,4-triazol-3-yl)thio]acetamide::N-(2,3-dihydro-1,4-benzodioxin-6-yl)-2-[(1-phenyl-1H-1,2,4-triazol-3-yl)thio]acetamide::SMR000077733::cid_2215525
SMILES O=C(CSc1ncn(n1)-c1ccccc1)Nc1ccc2OCCOc2c1
InChI Key InChIKey=JNDNPBRGNBHMTR-UHFFFAOYSA-N
Data  2 IC50
  Tab Delimited (TSV)   2D SDfile   Computed 3D by Vconf -m prep SDfile
Find this compound or compounds like it in BindingDB:
Activity Spreadsheet -- Enzyme Inhibition Constant Data from BindingDB
Found 2 hits for monomerid = 87695
TargetPolyadenylate-binding protein 1(Homo sapiens (Human))
Burnham Center For Chemical Genomics
Curated by PubChem BioAssay
LigandPNGBDBM87695(MLS000050605 | N-(2,3-dihydro-1,4-benzodioxin-6-yl...)
Affinity DataIC50: >6.60E+4nM. Assay description: Data Source: Sanford-Burnham Center for Chemical Genomics (SBCCG) Source Affiliation: Sanford-Burnham Medical Research Institute (SBMRI, San Diego, C...
In DepthDetails PCBioAssay
TargetPolyadenylate-binding protein 1(Homo sapiens (Human))
Burnham Center For Chemical Genomics
Curated by PubChem BioAssay
LigandPNGBDBM87695(MLS000050605 | N-(2,3-dihydro-1,4-benzodioxin-6-yl...)
Affinity DataIC50: >6.60E+4nM. Assay description: Data Source: Sanford-Burnham Center for Chemical Genomics (SBCCG) Source Affiliation: Sanford-Burnham Medical Research Institute (SBMRI, San Diego, C...
In DepthDetails PCBioAssay