BDBM87826 1-(1-butyl-2-benzimidazolyl)-3-phenylthiourea::1-(1-butylbenzimidazol-2-yl)-3-phenyl-thiourea::1-(1-butylbenzimidazol-2-yl)-3-phenylthiourea::MLS000578243::N-(1-butyl-1H-benzimidazol-2-yl)-N'-phenylthiourea::SMR000197652::cid_2931173
SMILES CCCCn1c(NC(=S)Nc2ccccc2)nc2ccccc12
InChI Key InChIKey=JIYBCRRQQZXWIG-UHFFFAOYSA-N
Data  1 IC50
  Tab Delimited (TSV)   2D SDfile   Computed 3D by Vconf -m prep SDfile
Find this compound or compounds like it in BindingDB:
Activity Spreadsheet -- Enzyme Inhibition Constant Data from BindingDB
Found 1 hit for monomerid = 87826
TargetDNA (cytosine-5)-methyltransferase 1(Homo sapiens (Human))
Burnham Center For Chemical Genomics
Curated by PubChem BioAssay
LigandPNGBDBM87826(1-(1-butyl-2-benzimidazolyl)-3-phenylthiourea | 1-...)
Affinity DataIC50:  1.02E+3nM. Assay description: Data Source: Sanford-Burnham Center for Chemical Genomics (SBCCG) Source Affiliation: Sanford-Burnham Medical Research Institute (SBMRI, San Diego, C...
In DepthDetails PCBioAssay