BDBM88425 MLS000523054::N-(3-ethoxypropyl)-N-(2-furanylmethyl)-8-methyl-4-oxo-5H-thieno[3,2-c]quinoline-2-carboxamide::N-(3-ethoxypropyl)-N-(2-furfuryl)-4-keto-8-methyl-5H-thieno[3,2-c]quinoline-2-carboxamide::N-(3-ethoxypropyl)-N-(furan-2-ylmethyl)-8-methyl-4-oxidanylidene-5H-thieno[3,2-c]quinoline-2-carboxamide::N-(3-ethoxypropyl)-N-(furan-2-ylmethyl)-8-methyl-4-oxo-5H-thieno[3,2-c]quinoline-2-carboxamide::SMR000128320::cid_9550523
SMILES CCOCCCN(Cc1ccco1)C(=O)c1cc2c(s1)c1cc(C)ccc1[nH]c2=O
InChI Key InChIKey=XKFIIQRBGZOBEQ-UHFFFAOYSA-N
Data  2 EC50
  Tab Delimited (TSV)   2D SDfile   Computed 3D by Vconf -m prep SDfile
Find this compound or compounds like it in BindingDB:
Activity Spreadsheet -- Enzyme Inhibition Constant Data from BindingDB
Found 2 hits for monomerid = 88425
TargetDelta-type opioid receptor(Homo sapiens (Human))
The Scripps Research Institute Molecular Screening Center
Curated by PubChem BioAssay
LigandPNGBDBM88425(MLS000523054 | N-(3-ethoxypropyl)-N-(2-furanylmeth...)
Affinity DataEC50: >6.46E+4nM. Assay description: Source (MLPCN Center Name): The Scripps Research Institute Molecular Screening Center (SRISMC) Center Affiliation: The Scripps Research Institute, TS...
In DepthDetails PCBioAssay
TargetMelanocortin receptor 4(Homo sapiens (Human))
The Scripps Research Institute Molecular Screening Center
Curated by PubChem BioAssay
LigandPNGBDBM88425(MLS000523054 | N-(3-ethoxypropyl)-N-(2-furanylmeth...)
Affinity DataEC50: >8.92E+4nM. Assay description: Source (MLPCN Center Name): The Scripps Research Institute Molecular Screening Center (SRISMC) Center Affiliation: The Scripps Research Institute, TS...
In DepthDetails PCBioAssay