BDBM88426 5-bromanyl-N-[4-[5-(2-methylphenyl)-1,2,4-oxadiazol-3-yl]phenyl]furan-2-carboxamide::5-bromo-N-[4-[5-(2-methylphenyl)-1,2,4-oxadiazol-3-yl]phenyl]-2-furancarboxamide::5-bromo-N-[4-[5-(2-methylphenyl)-1,2,4-oxadiazol-3-yl]phenyl]furan-2-carboxamide::5-bromo-N-[4-[5-(o-tolyl)-1,2,4-oxadiazol-3-yl]phenyl]-2-furamide::MLS000521292::SMR000131700::cid_5070905
SMILES Cc1ccccc1-c1nc(no1)-c1ccc(NC(=O)c2ccc(Br)o2)cc1
InChI Key InChIKey=OBPNRGGUFSHYKJ-UHFFFAOYSA-N
Data  2 EC50
  Tab Delimited (TSV)   2D SDfile   Computed 3D by Vconf -m prep SDfile
Find this compound or compounds like it in BindingDB:
Activity Spreadsheet -- Enzyme Inhibition Constant Data from BindingDB
Found 2 hits for monomerid = 88426
TargetDelta-type opioid receptor(Homo sapiens (Human))
The Scripps Research Institute Molecular Screening Center
Curated by PubChem BioAssay
LigandPNGBDBM88426(5-bromanyl-N-[4-[5-(2-methylphenyl)-1,2,4-oxadiazo...)
Affinity DataEC50: >9.25E+4nM. Assay description: Source (MLPCN Center Name): The Scripps Research Institute Molecular Screening Center (SRISMC) Center Affiliation: The Scripps Research Institute, TS...
In DepthDetails PCBioAssay
TargetMelanocortin receptor 4(Homo sapiens (Human))
The Scripps Research Institute Molecular Screening Center
Curated by PubChem BioAssay
LigandPNGBDBM88426(5-bromanyl-N-[4-[5-(2-methylphenyl)-1,2,4-oxadiazo...)
Affinity DataEC50: >8.92E+4nM. Assay description: Source (MLPCN Center Name): The Scripps Research Institute Molecular Screening Center (SRISMC) Center Affiliation: The Scripps Research Institute, TS...
In DepthDetails PCBioAssay