BDBM88427 MLS000536371::N-[4-[5-(2-methylphenyl)-1,2,4-oxadiazol-3-yl]phenyl]-1,3-benzodioxole-5-carboxamide::N-[4-[5-(o-tolyl)-1,2,4-oxadiazol-3-yl]phenyl]-piperonylamide::N-{4-[5-(2-methylphenyl)-1,2,4-oxadiazol-3-yl]phenyl}-1,3-benzodioxole-5-carboxamide::SMR000143408::cid_1292146
SMILES Cc1ccccc1-c1nc(no1)-c1ccc(NC(=O)c2ccc3OCOc3c2)cc1
InChI Key InChIKey=ARRJDAAWXQRBKY-UHFFFAOYSA-N
Data  2 EC50
  Tab Delimited (TSV)   2D SDfile   Computed 3D by Vconf -m prep SDfile
Find this compound or compounds like it in BindingDB:
Activity Spreadsheet -- Enzyme Inhibition Constant Data from BindingDB
Found 2 hits for monomerid = 88427
TargetDelta-type opioid receptor(Homo sapiens (Human))
The Scripps Research Institute Molecular Screening Center
Curated by PubChem BioAssay
LigandPNGBDBM88427(MLS000536371 | N-[4-[5-(2-methylphenyl)-1,2,4-oxad...)
Affinity DataEC50: >9.24E+4nM. Assay description: Source (MLPCN Center Name): The Scripps Research Institute Molecular Screening Center (SRISMC) Center Affiliation: The Scripps Research Institute, TS...
In DepthDetails PCBioAssay
TargetMelanocortin receptor 4(Homo sapiens (Human))
The Scripps Research Institute Molecular Screening Center
Curated by PubChem BioAssay
LigandPNGBDBM88427(MLS000536371 | N-[4-[5-(2-methylphenyl)-1,2,4-oxad...)
Affinity DataEC50: >8.91E+4nM. Assay description: Source (MLPCN Center Name): The Scripps Research Institute Molecular Screening Center (SRISMC) Center Affiliation: The Scripps Research Institute, TS...
In DepthDetails PCBioAssay