BDBM88476 1,4-dioxane;6-phenyl-2-[(4,6,8-trimethyl-2-quinazolinyl)amino]-1H-pyrimidin-4-one::1,4-dioxane;6-phenyl-2-[(4,6,8-trimethylquinazolin-2-yl)amino]-1H-pyrimidin-4-one::6-Phenyl-2-(4,6,8-trimethyl-quinazolin-2-ylamino)-pyrimidin-4-ol::MLS000777863::SMR000414249::cid_16682004
SMILES Cc1cc(C)c2nc(Nc3nc(cc(=O)[nH]3)-c3ccccc3)nc(C)c2c1
InChI Key InChIKey=JIGWMNRWIILAAP-UHFFFAOYSA-N
Data  2 EC50
  Tab Delimited (TSV)   2D SDfile   Computed 3D by Vconf -m prep SDfile
Find this compound or compounds like it in BindingDB:
Activity Spreadsheet -- Enzyme Inhibition Constant Data from BindingDB
Found 2 hits for monomerid = 88476
TargetDelta-type opioid receptor(Homo sapiens (Human))
The Scripps Research Institute Molecular Screening Center
Curated by PubChem BioAssay
LigandPNGBDBM88476(1,4-dioxane;6-phenyl-2-[(4,6,8-trimethyl-2-quinazo...)
Affinity DataEC50: >9.25E+4nM. Assay description: Source (MLPCN Center Name): The Scripps Research Institute Molecular Screening Center (SRISMC) Center Affiliation: The Scripps Research Institute, TS...
In DepthDetails PCBioAssay
TargetMelanocortin receptor 4(Homo sapiens (Human))
The Scripps Research Institute Molecular Screening Center
Curated by PubChem BioAssay
LigandPNGBDBM88476(1,4-dioxane;6-phenyl-2-[(4,6,8-trimethyl-2-quinazo...)
Affinity DataEC50: >8.92E+4nM. Assay description: Source (MLPCN Center Name): The Scripps Research Institute Molecular Screening Center (SRISMC) Center Affiliation: The Scripps Research Institute, TS...
In DepthDetails PCBioAssay