BDBM88498 (4-fluorophenyl)methyl-hexadecyl-dimethyl-azanium;chloride::(4-fluorophenyl)methyl-hexadecyl-dimethylammonium;chloride::(4-fluorophenyl)methyl-hexadecyl-dimethylazanium;chloride::MLS002702413::SMR001565975::cetyl-(4-fluorobenzyl)-dimethyl-ammonium;chloride::cid_392616
SMILES CCCCCCCCCCCCCCCC[N+](C)(C)Cc1ccc(F)cc1
InChI Key InChIKey=IGFHCKWGBWALHX-UHFFFAOYSA-N
Data  2 IC50  2 EC50
  Tab Delimited (TSV)   2D SDfile   Computed 3D by Vconf -m prep SDfile
Find this compound or compounds like it in BindingDB:
Activity Spreadsheet -- Enzyme Inhibition Constant Data from BindingDB
Found 4 hits for monomerid = 88498
TargetProthrombin(Bos taurus (Bovine))
Burnham Center For Chemical Genomics
Curated by PubChem BioAssay
LigandPNGBDBM88498((4-fluorophenyl)methyl-hexadecyl-dimethyl-azanium;...)
Affinity DataIC50:  3.74E+4nM. Assay description: Data Source: Sanford-Burnham Center for Chemical Genomics (SBCCG) Source Affiliation: Sanford Burnham Medical Research Institute (SBMRI, La Jolla, CA...
In DepthDetails PCBioAssay
Target26S proteasome non-ATPase regulatory subunit 14(Homo sapiens (Human))
Burnham Center For Chemical Genomics
Curated by PubChem BioAssay
LigandPNGBDBM88498((4-fluorophenyl)methyl-hexadecyl-dimethyl-azanium;...)
Affinity DataIC50:  6.11E+4nM. Assay description: Data Source: Sanford-Burnham Center for Chemical Genomics (SBCCG) Source Affiliation: Sanford Burnham Medical Research Institute (SBMRI, La Jolla, CA...
In DepthDetails PCBioAssay
TargetDelta-type opioid receptor(Homo sapiens (Human))
The Scripps Research Institute Molecular Screening Center
Curated by PubChem BioAssay
LigandPNGBDBM88498((4-fluorophenyl)methyl-hexadecyl-dimethyl-azanium;...)
Affinity DataEC50: >9.25E+4nM. Assay description: Source (MLPCN Center Name): The Scripps Research Institute Molecular Screening Center (SRISMC) Center Affiliation: The Scripps Research Institute, TS...
In DepthDetails PCBioAssay
TargetMelanocortin receptor 4(Homo sapiens (Human))
The Scripps Research Institute Molecular Screening Center
Curated by PubChem BioAssay
LigandPNGBDBM88498((4-fluorophenyl)methyl-hexadecyl-dimethyl-azanium;...)
Affinity DataEC50: >8.92E+4nM. Assay description: Source (MLPCN Center Name): The Scripps Research Institute Molecular Screening Center (SRISMC) Center Affiliation: The Scripps Research Institute, TS...
In DepthDetails PCBioAssay