BDBM88512 MLS003124320::N-[6-(3-fluorophenyl)-3-(4-fluorophenyl)-8-imidazo[1,2-a]pyridinyl]acetamide::N-[6-(3-fluorophenyl)-3-(4-fluorophenyl)imidazo[1,2-a]pyridin-8-yl]acetamide::N-[6-(3-fluorophenyl)-3-(4-fluorophenyl)imidazo[1,2-a]pyridin-8-yl]ethanamide::SMR001292701::cid_46943131
SMILES CC(=O)Nc1cc(cn2c(cnc12)-c1ccc(F)cc1)-c1cccc(F)c1
InChI Key InChIKey=DCLGIQNIXSIEPG-UHFFFAOYSA-N
Data  2 EC50
  Tab Delimited (TSV)   2D SDfile   Computed 3D by Vconf -m prep SDfile
Find this compound or compounds like it in BindingDB:
Activity Spreadsheet -- Enzyme Inhibition Constant Data from BindingDB
Found 2 hits for monomerid = 88512
TargetDelta-type opioid receptor(Homo sapiens (Human))
The Scripps Research Institute Molecular Screening Center
Curated by PubChem BioAssay
LigandPNGBDBM88512(MLS003124320 | N-[6-(3-fluorophenyl)-3-(4-fluoroph...)
Affinity DataEC50: >9.25E+4nM. Assay description: Source (MLPCN Center Name): The Scripps Research Institute Molecular Screening Center (SRISMC) Center Affiliation: The Scripps Research Institute, TS...
In DepthDetails PCBioAssay
TargetMelanocortin receptor 4(Homo sapiens (Human))
The Scripps Research Institute Molecular Screening Center
Curated by PubChem BioAssay
LigandPNGBDBM88512(MLS003124320 | N-[6-(3-fluorophenyl)-3-(4-fluoroph...)
Affinity DataEC50: >8.92E+4nM. Assay description: Source (MLPCN Center Name): The Scripps Research Institute Molecular Screening Center (SRISMC) Center Affiliation: The Scripps Research Institute, TS...
In DepthDetails PCBioAssay