BDBM88602 MLS000589614::N-phenylcarbamic acid [2-(phenylcarbamoyloxy)-6-bicyclo[3.3.1]nonanyl] ester::N-phenylcarbamic acid [2-[anilino(oxo)methoxy]-6-bicyclo[3.3.1]nonanyl] ester::SMR000212952::[2-(phenylcarbamoyloxy)-6-bicyclo[3.3.1]nonanyl] N-phenylcarbamate::cid_3617229
SMILES [H]C12CCC(OC(=O)Nc3ccccc3)C([H])(CCC1OC(=O)Nc1ccccc1)C2
InChI Key InChIKey=ZDOATINBKFYDSR-UHFFFAOYSA-N
Data  1 IC50
  Tab Delimited (TSV)   2D SDfile   Computed 3D by Vconf -m prep SDfile
Find this compound or compounds like it in BindingDB:
Activity Spreadsheet -- Enzyme Inhibition Constant Data from BindingDB
Found 1 hit for monomerid = 88602
TargetMelanocortin receptor 4(Homo sapiens (Human))
The Scripps Research Institute Molecular Screening Center
Curated by PubChem BioAssay
LigandPNGBDBM88602(MLS000589614 | N-phenylcarbamic acid [2-(phenylcar...)
Affinity DataIC50:  7.46E+3nM. Assay description: Source (MLPCN Center Name): The Scripps Research Institute Molecular Screening Center (SRISMC) Center Affiliation: The Scripps Research Institute, TS...
In DepthDetails PCBioAssay