BDBM88614 5-amino-3-[[2-[(3,4-dimethylphenyl)sulfonylamino]-1-oxoethoxy]methyl]thiophene-2,4-dicarboxylic acid dimethyl ester::5-amino-3-[[2-[(3,4-dimethylphenyl)sulfonylamino]acetyl]oxymethyl]thiophene-2,4-dicarboxylic acid dimethyl ester::MLS000394686::SMR000242829::cid_2508583::dimethyl 5-amino-3-[[2-[(3,4-dimethylphenyl)sulfonylamino]acetyl]oxymethyl]thiophene-2,4-dicarboxylate::dimethyl 5-azanyl-3-[2-[(3,4-dimethylphenyl)sulfonylamino]ethanoyloxymethyl]thiophene-2,4-dicarboxylate
SMILES COC(=O)c1sc(N)c(C(=O)OC)c1COC(=O)CNS(=O)(=O)c1ccc(C)c(C)c1
InChI Key InChIKey=VMCJSHQXHMQQPP-UHFFFAOYSA-N
Data  1 IC50
  Tab Delimited (TSV)   2D SDfile   Computed 3D by Vconf -m prep SDfile
Find this compound or compounds like it in BindingDB:
Activity Spreadsheet -- Enzyme Inhibition Constant Data from BindingDB
Found 1 hit for monomerid = 88614
TargetMelanocortin receptor 4(Homo sapiens (Human))
The Scripps Research Institute Molecular Screening Center
Curated by PubChem BioAssay
LigandPNGBDBM88614(5-amino-3-[[2-[(3,4-dimethylphenyl)sulfonylamino]-...)
Affinity DataIC50: >6.46E+4nM. Assay description: Source (MLPCN Center Name): The Scripps Research Institute Molecular Screening Center (SRISMC) Center Affiliation: The Scripps Research Institute, TS...
In DepthDetails PCBioAssay