BDBM88618 1-methyl-4-[2-[4-(trifluoromethyl)phenyl]sulfanylphenoxy]piperidine;oxalic acid::1-methyl-4-[2-[[4-(trifluoromethyl)phenyl]thio]phenoxy]piperidine;oxalic acid::1-methyl-4-piperidinyl 2-{[4-(trifluoromethyl)phenyl]sulfanyl}phenyl ether::MLS000703854::SMR000224863::cid_14400561::ethanedioic acid;1-methyl-4-[2-[4-(trifluoromethyl)phenyl]sulfanylphenoxy]piperidine
SMILES CN1CCC(CC1)Oc1ccccc1Sc1ccc(cc1)C(F)(F)F
InChI Key InChIKey=MPXWIWCJZHUHQR-UHFFFAOYSA-N
Data  1 IC50
  Tab Delimited (TSV)   2D SDfile   Computed 3D by Vconf -m prep SDfile
Find this compound or compounds like it in BindingDB:
Activity Spreadsheet -- Enzyme Inhibition Constant Data from BindingDB
Found 1 hit for monomerid = 88618
TargetMelanocortin receptor 4(Homo sapiens (Human))
The Scripps Research Institute Molecular Screening Center
Curated by PubChem BioAssay
LigandPNGBDBM88618(1-methyl-4-[2-[4-(trifluoromethyl)phenyl]sulfanylp...)
Affinity DataIC50: >6.46E+4nM. Assay description: Source (MLPCN Center Name): The Scripps Research Institute Molecular Screening Center (SRISMC) Center Affiliation: The Scripps Research Institute, TS...
In DepthDetails PCBioAssay