BDBM88626 (phenylmethyl) 2-(2,2-diphenylethanoylamino)ethanoate::2-[(1-oxo-2,2-diphenylethyl)amino]acetic acid (phenylmethyl) ester::2-[(2,2-diphenylacetyl)amino]acetic acid benzyl ester::MLS000688236::SMR000283888::benzyl 2-[(2,2-diphenylacetyl)amino]acetate::cid_1100660
SMILES O=C(CNC(=O)C(c1ccccc1)c1ccccc1)OCc1ccccc1
InChI Key InChIKey=LZVTUCSZHWLWST-UHFFFAOYSA-N
Data  1 IC50
  Tab Delimited (TSV)   2D SDfile   Computed 3D by Vconf -m prep SDfile
Find this compound or compounds like it in BindingDB:
Activity Spreadsheet -- Enzyme Inhibition Constant Data from BindingDB
Found 1 hit for monomerid = 88626
TargetMelanocortin receptor 4(Homo sapiens (Human))
The Scripps Research Institute Molecular Screening Center
Curated by PubChem BioAssay
LigandPNGBDBM88626((phenylmethyl) 2-(2,2-diphenylethanoylamino)ethano...)
Affinity DataIC50: >6.46E+4nM. Assay description: Source (MLPCN Center Name): The Scripps Research Institute Molecular Screening Center (SRISMC) Center Affiliation: The Scripps Research Institute, TS...
In DepthDetails PCBioAssay