BDBM88637 5-[3-(4-ethylpiperazino)propanoylamino]-3-methyl-thiophene-2,4-dicarboxylic acid diethyl ester::5-[[3-(4-ethyl-1-piperazinyl)-1-oxopropyl]amino]-3-methylthiophene-2,4-dicarboxylic acid diethyl ester::MLS001011145::SMR000353139::cid_1183197::diethyl 5-[3-(4-ethylpiperazin-1-yl)propanoylamino]-3-methyl-thiophene-2,4-dicarboxylate::diethyl 5-[3-(4-ethylpiperazin-1-yl)propanoylamino]-3-methylthiophene-2,4-dicarboxylate
SMILES CCOC(=O)c1sc(NC(=O)CCN2CCN(CC)CC2)c(C(=O)OCC)c1C
InChI Key InChIKey=KIXWJXQGZKHFMX-UHFFFAOYSA-N
Data  1 IC50
  Tab Delimited (TSV)   2D SDfile   Computed 3D by Vconf -m prep SDfile
Find this compound or compounds like it in BindingDB:
Activity Spreadsheet -- Enzyme Inhibition Constant Data from BindingDB
Found 1 hit for monomerid = 88637
TargetMelanocortin receptor 4(Homo sapiens (Human))
The Scripps Research Institute Molecular Screening Center
Curated by PubChem BioAssay
LigandPNGBDBM88637(5-[3-(4-ethylpiperazino)propanoylamino]-3-methyl-t...)
Affinity DataIC50: >6.46E+4nM. Assay description: Source (MLPCN Center Name): The Scripps Research Institute Molecular Screening Center (SRISMC) Center Affiliation: The Scripps Research Institute, TS...
In DepthDetails PCBioAssay