BDBM88638 2-[4-[benzenesulfonyl(ethyl)amino]phenoxy]acetic acid [2-(4-amino-1,3-dimethyl-2,6-dioxo-5-pyrimidinyl)-2-oxoethyl] ester::2-[4-[besyl(ethyl)amino]phenoxy]acetic acid [2-(4-amino-2,6-diketo-1,3-dimethyl-pyrimidin-5-yl)-2-keto-ethyl] ester::MLS000773980::SMR000364808::[2-(4-amino-1,3-dimethyl-2,6-dioxopyrimidin-5-yl)-2-oxoethyl] 2-[4-[benzenesulfonyl(ethyl)amino]phenoxy]acetate::[2-[4-azanyl-1,3-dimethyl-2,6-bis(oxidanylidene)pyrimidin-5-yl]-2-oxidanylidene-ethyl] 2-[4-[ethyl(phenylsulfonyl)amino]phenoxy]ethanoate::cid_2358776
SMILES CCN(c1ccc(OCC(=O)OCC(=O)c2c(N)n(C)c(=O)n(C)c2=O)cc1)S(=O)(=O)c1ccccc1
InChI Key InChIKey=SZYUMEQASWYGJJ-UHFFFAOYSA-N
Data  1 IC50
  Tab Delimited (TSV)   2D SDfile   Computed 3D by Vconf -m prep SDfile
Find this compound or compounds like it in BindingDB:
Activity Spreadsheet -- Enzyme Inhibition Constant Data from BindingDB
Found 1 hit for monomerid = 88638
TargetMelanocortin receptor 4(Homo sapiens (Human))
The Scripps Research Institute Molecular Screening Center
Curated by PubChem BioAssay
LigandPNGBDBM88638(2-[4-[benzenesulfonyl(ethyl)amino]phenoxy]acetic a...)
Affinity DataIC50: >7.18E+3nM. Assay description: Source (MLPCN Center Name): The Scripps Research Institute Molecular Screening Center (SRISMC) Center Affiliation: The Scripps Research Institute, TS...
In DepthDetails PCBioAssay