BDBM88724 (4-bromophenyl)-(4-ethyl-1-piperazinyl)methanethione::(4-bromophenyl)-(4-ethylpiperazin-1-yl)methanethione::(4-bromophenyl)-(4-ethylpiperazino)methanethione::1-[(4-bromophenyl)carbonothioyl]-4-ethylpiperazine::MLS000576805::SMR000198085::cid_888529
SMILES CCN1CCN(CC1)C(=S)c1ccc(Br)cc1
InChI Key InChIKey=SRRXZDLALXNSBQ-UHFFFAOYSA-N
Data  4 IC50
  Tab Delimited (TSV)   2D SDfile   Computed 3D by Vconf -m prep SDfile
Find this compound or compounds like it in BindingDB:
Activity Spreadsheet -- Enzyme Inhibition Constant Data from BindingDB
Found 4 hits for monomerid = 88724
TargetTyrosine-protein phosphatase non-receptor type 5(Homo sapiens (Human))
Burnham Center For Chemical Genomics
Curated by PubChem BioAssay
LigandPNGBDBM88724((4-bromophenyl)-(4-ethyl-1-piperazinyl)methanethio...)
Affinity DataIC50:  3.94E+4nM. Assay description: Data Source: Sanford-Burnham Center for Chemical Genomics (SBCCG) Source Affiliation: Sanford-Burnham Medical Research Institute (SBMRI, San Diego, C...
In DepthDetails PCBioAssay
TargetTyrosine-protein phosphatase non-receptor type 5(Homo sapiens (Human))
Burnham Center For Chemical Genomics
Curated by PubChem BioAssay
LigandPNGBDBM88724((4-bromophenyl)-(4-ethyl-1-piperazinyl)methanethio...)
Affinity DataIC50:  6.39E+4nM. Assay description: Data Source: Sanford-Burnham Center for Chemical Genomics (SBCCG) Source Affiliation: Sanford-Burnham Medical Research Institute (SBMRI, San Diego, C...
In DepthDetails PCBioAssay
TargetTyrosine-protein phosphatase non-receptor type 11(Homo sapiens (Human))
Burnham Center For Chemical Genomics
Curated by PubChem BioAssay
LigandPNGBDBM88724((4-bromophenyl)-(4-ethyl-1-piperazinyl)methanethio...)
Affinity DataIC50:  1.88E+3nM. Assay description: Data Source: Sanford-Burnham Center for Chemical Genomics (SBCCG) Source Affiliation: Sanford-Burnham Medical Research Institute (SBMRI, San Diego, C...
In DepthDetails PCBioAssay
TargetDual specificity protein phosphatase 3(Homo sapiens (Human))
Burnham Center For Chemical Genomics
Curated by PubChem BioAssay
LigandPNGBDBM88724((4-bromophenyl)-(4-ethyl-1-piperazinyl)methanethio...)
Affinity DataIC50:  942nM. Assay description: Data Source: Sanford-Burnham Center for Chemical Genomics (SBCCG) Source Affiliation: Sanford-Burnham Medical Research Institute (SBMRI, San Diego, C...
In DepthDetails PCBioAssay