BDBM88734 3-(4-chloranyl-2-methoxy-phenyl)-1-[(1-methylindol-3-yl)methyl]-1-(3-morpholin-4-ylpropyl)thiourea::3-(4-chloro-2-methoxy-phenyl)-1-[(1-methylindol-3-yl)methyl]-1-(3-morpholinopropyl)thiourea::3-(4-chloro-2-methoxyphenyl)-1-[(1-methyl-3-indolyl)methyl]-1-[3-(4-morpholinyl)propyl]thiourea::3-(4-chloro-2-methoxyphenyl)-1-[(1-methylindol-3-yl)methyl]-1-(3-morpholin-4-ylpropyl)thiourea::MLS000583933::N'-(4-chloro-2-methoxyphenyl)-N-[(1-methyl-1H-indol-3-yl)methyl]-N-(3-morpholin-4-ylpropyl)thiourea::SMR000206919::cid_12004931
SMILES COc1cc(Cl)ccc1NC(=S)N(CCCN1CCOCC1)Cc1cn(C)c2ccccc12
InChI Key InChIKey=RORPXDNXKUJQBQ-UHFFFAOYSA-N
Data  5 IC50
  Tab Delimited (TSV)   2D SDfile   Computed 3D by Vconf -m prep SDfile
Find this compound or compounds like it in BindingDB:
Activity Spreadsheet -- Enzyme Inhibition Constant Data from BindingDB
Found 5 hits for monomerid = 88734
TargetTyrosine-protein phosphatase non-receptor type 5(Homo sapiens (Human))
Burnham Center For Chemical Genomics
Curated by PubChem BioAssay
LigandPNGBDBM88734(3-(4-chloranyl-2-methoxy-phenyl)-1-[(1-methylindol...)
Affinity DataIC50:  2.08E+4nM. Assay description: Data Source: Sanford-Burnham Center for Chemical Genomics (SBCCG) Source Affiliation: Sanford-Burnham Medical Research Institute (SBMRI, San Diego, C...
In DepthDetails PCBioAssay
TargetDual specificity protein phosphatase 3(Homo sapiens (Human))
Burnham Center For Chemical Genomics
Curated by PubChem BioAssay
LigandPNGBDBM88734(3-(4-chloranyl-2-methoxy-phenyl)-1-[(1-methylindol...)
Affinity DataIC50:  1.03E+3nM. Assay description: Data Source: Sanford-Burnham Center for Chemical Genomics (SBCCG) Source Affiliation: Sanford-Burnham Medical Research Institute (SBMRI, San Diego, C...
In DepthDetails PCBioAssay
TargetTyrosine-protein phosphatase non-receptor type 22(Homo sapiens (Human))
Burnham Center For Chemical Genomics
Curated by PubChem BioAssay
LigandPNGBDBM88734(3-(4-chloranyl-2-methoxy-phenyl)-1-[(1-methylindol...)
Affinity DataIC50: >1.00E+5nM. Assay description: Data Source: Sanford-Burnham Center for Chemical Genomics (SBCCG) Source Affiliation: Sanford-Burnham Medical Research Institute (SBMRI, San Diego, C...
In DepthDetails PCBioAssay
TargetTyrosine-protein phosphatase non-receptor type 5(Homo sapiens (Human))
Burnham Center For Chemical Genomics
Curated by PubChem BioAssay
LigandPNGBDBM88734(3-(4-chloranyl-2-methoxy-phenyl)-1-[(1-methylindol...)
Affinity DataIC50:  3.44E+4nM. Assay description: Data Source: Sanford-Burnham Center for Chemical Genomics (SBCCG) Source Affiliation: Sanford-Burnham Medical Research Institute (SBMRI, San Diego, C...
In DepthDetails PCBioAssay
TargetTyrosine-protein phosphatase non-receptor type 11(Homo sapiens (Human))
Burnham Center For Chemical Genomics
Curated by PubChem BioAssay
LigandPNGBDBM88734(3-(4-chloranyl-2-methoxy-phenyl)-1-[(1-methylindol...)
Affinity DataIC50:  2.07E+3nM. Assay description: Data Source: Sanford-Burnham Center for Chemical Genomics (SBCCG) Source Affiliation: Sanford-Burnham Medical Research Institute (SBMRI, San Diego, C...
In DepthDetails PCBioAssay