BDBM88735 1-(2-methoxyethyl)-1-(1-pyridin-3-ylethyl)-3-(2,4,6-trimethylphenyl)thiourea::1-(2-methoxyethyl)-1-[1-(3-pyridinyl)ethyl]-3-(2,4,6-trimethylphenyl)thiourea::3-mesityl-1-(2-methoxyethyl)-1-[1-(3-pyridyl)ethyl]thiourea::MLS000584539::N'-mesityl-N-(2-methoxyethyl)-N-(1-pyridin-3-ylethyl)thiourea::SMR000207125::cid_4105237
SMILES COCCN(C(C)c1cccnc1)C(=S)Nc1c(C)cc(C)cc1C
InChI Key InChIKey=HOUCBLREQJLWJI-UHFFFAOYSA-N
Data  4 IC50
  Tab Delimited (TSV)   2D SDfile   Computed 3D by Vconf -m prep SDfile
Find this compound or compounds like it in BindingDB:
Activity Spreadsheet -- Enzyme Inhibition Constant Data from BindingDB
Found 4 hits for monomerid = 88735
TargetTyrosine-protein phosphatase non-receptor type 5(Homo sapiens (Human))
Burnham Center For Chemical Genomics
Curated by PubChem BioAssay
LigandPNGBDBM88735(1-(2-methoxyethyl)-1-(1-pyridin-3-ylethyl)-3-(2,4,...)
Affinity DataIC50: >8.00E+4nM. Assay description: Data Source: Sanford-Burnham Center for Chemical Genomics (SBCCG) Source Affiliation: Sanford-Burnham Medical Research Institute (SBMRI, San Diego, C...
In DepthDetails PCBioAssay
TargetTyrosine-protein phosphatase non-receptor type 5(Homo sapiens (Human))
Burnham Center For Chemical Genomics
Curated by PubChem BioAssay
LigandPNGBDBM88735(1-(2-methoxyethyl)-1-(1-pyridin-3-ylethyl)-3-(2,4,...)
Affinity DataIC50: >8.00E+4nM. Assay description: Data Source: Sanford-Burnham Center for Chemical Genomics (SBCCG) Source Affiliation: Sanford-Burnham Medical Research Institute (SBMRI, San Diego, C...
In DepthDetails PCBioAssay
TargetTyrosine-protein phosphatase non-receptor type 11(Homo sapiens (Human))
Burnham Center For Chemical Genomics
Curated by PubChem BioAssay
LigandPNGBDBM88735(1-(2-methoxyethyl)-1-(1-pyridin-3-ylethyl)-3-(2,4,...)
Affinity DataIC50:  1.71E+3nM. Assay description: Data Source: Sanford-Burnham Center for Chemical Genomics (SBCCG) Source Affiliation: Sanford-Burnham Medical Research Institute (SBMRI, San Diego, C...
In DepthDetails PCBioAssay
TargetDual specificity protein phosphatase 3(Homo sapiens (Human))
Burnham Center For Chemical Genomics
Curated by PubChem BioAssay
LigandPNGBDBM88735(1-(2-methoxyethyl)-1-(1-pyridin-3-ylethyl)-3-(2,4,...)
Affinity DataIC50:  696nM. Assay description: Data Source: Sanford-Burnham Center for Chemical Genomics (SBCCG) Source Affiliation: Sanford-Burnham Medical Research Institute (SBMRI, San Diego, C...
In DepthDetails PCBioAssay