BDBM88753 MLS000683155::SMR000322983::[4-(2-methylphenyl)-1-piperazinyl]-[5-(3-nitrophenyl)-2-furanyl]methanethione::[4-(2-methylphenyl)piperazin-1-yl]-[5-(3-nitrophenyl)furan-2-yl]methanethione::[5-(3-nitrophenyl)-2-furyl]-[4-(o-tolyl)piperazino]methanethione::cid_3679607
SMILES Cc1ccccc1N1CCN(CC1)C(=S)c1ccc(o1)-c1cccc(c1)[N+]([O-])=O
InChI Key InChIKey=PLTYNHYSKIPBNU-UHFFFAOYSA-N
Data  4 IC50
  Tab Delimited (TSV)   2D SDfile   Computed 3D by Vconf -m prep SDfile
Find this compound or compounds like it in BindingDB:
Activity Spreadsheet -- Enzyme Inhibition Constant Data from BindingDB
Found 4 hits for monomerid = 88753
TargetTyrosine-protein phosphatase non-receptor type 5(Homo sapiens (Human))
Burnham Center For Chemical Genomics
Curated by PubChem BioAssay
LigandPNGBDBM88753(MLS000683155 | SMR000322983 | [4-(2-methylphenyl)-...)
Affinity DataIC50:  6.22E+4nM. Assay description: Data Source: Sanford-Burnham Center for Chemical Genomics (SBCCG) Source Affiliation: Sanford-Burnham Medical Research Institute (SBMRI, San Diego, C...
In DepthDetails PCBioAssay
TargetTyrosine-protein phosphatase non-receptor type 5(Homo sapiens (Human))
Burnham Center For Chemical Genomics
Curated by PubChem BioAssay
LigandPNGBDBM88753(MLS000683155 | SMR000322983 | [4-(2-methylphenyl)-...)
Affinity DataIC50: >8.00E+4nM. Assay description: Data Source: Sanford-Burnham Center for Chemical Genomics (SBCCG) Source Affiliation: Sanford-Burnham Medical Research Institute (SBMRI, San Diego, C...
In DepthDetails PCBioAssay
TargetTyrosine-protein phosphatase non-receptor type 11(Homo sapiens (Human))
Burnham Center For Chemical Genomics
Curated by PubChem BioAssay
LigandPNGBDBM88753(MLS000683155 | SMR000322983 | [4-(2-methylphenyl)-...)
Affinity DataIC50:  1.13E+4nM. Assay description: Data Source: Sanford-Burnham Center for Chemical Genomics (SBCCG) Source Affiliation: Sanford-Burnham Medical Research Institute (SBMRI, San Diego, C...
In DepthDetails PCBioAssay
TargetDual specificity protein phosphatase 3(Homo sapiens (Human))
Burnham Center For Chemical Genomics
Curated by PubChem BioAssay
LigandPNGBDBM88753(MLS000683155 | SMR000322983 | [4-(2-methylphenyl)-...)
Affinity DataIC50:  4.61E+3nM. Assay description: Data Source: Sanford-Burnham Center for Chemical Genomics (SBCCG) Source Affiliation: Sanford-Burnham Medical Research Institute (SBMRI, San Diego, C...
In DepthDetails PCBioAssay