BDBM88756 2-[4-(4-ethylpiperazin-1-yl)carbothioylphenoxy]-N-(phenylmethyl)ethanamide::2-[4-[(4-ethyl-1-piperazinyl)-sulfanylidenemethyl]phenoxy]-N-(phenylmethyl)acetamide::MLS000666363::N-benzyl-2-[4-(4-ethylpiperazine-1-carbothioyl)phenoxy]acetamide::N-benzyl-2-{4-[(4-ethyl-1-piperazinyl)carbonothioyl]phenoxy}acetamide::SMR000294168::cid_2955551
SMILES CCN1CCN(CC1)C(=S)c1ccc(OCC(=O)NCc2ccccc2)cc1
InChI Key InChIKey=IFUYIHTXPMRRFI-UHFFFAOYSA-N
Data  4 IC50
  Tab Delimited (TSV)   2D SDfile   Computed 3D by Vconf -m prep SDfile
Find this compound or compounds like it in BindingDB:
Activity Spreadsheet -- Enzyme Inhibition Constant Data from BindingDB
Found 4 hits for monomerid = 88756
TargetTyrosine-protein phosphatase non-receptor type 5(Homo sapiens (Human))
Burnham Center For Chemical Genomics
Curated by PubChem BioAssay
LigandPNGBDBM88756(2-[4-(4-ethylpiperazin-1-yl)carbothioylphenoxy]-N-...)
Affinity DataIC50:  4.53E+4nM. Assay description: Data Source: Sanford-Burnham Center for Chemical Genomics (SBCCG) Source Affiliation: Sanford-Burnham Medical Research Institute (SBMRI, San Diego, C...
In DepthDetails PCBioAssay
TargetTyrosine-protein phosphatase non-receptor type 5(Homo sapiens (Human))
Burnham Center For Chemical Genomics
Curated by PubChem BioAssay
LigandPNGBDBM88756(2-[4-(4-ethylpiperazin-1-yl)carbothioylphenoxy]-N-...)
Affinity DataIC50: >8.00E+4nM. Assay description: Data Source: Sanford-Burnham Center for Chemical Genomics (SBCCG) Source Affiliation: Sanford-Burnham Medical Research Institute (SBMRI, San Diego, C...
In DepthDetails PCBioAssay
TargetTyrosine-protein phosphatase non-receptor type 11(Homo sapiens (Human))
Burnham Center For Chemical Genomics
Curated by PubChem BioAssay
LigandPNGBDBM88756(2-[4-(4-ethylpiperazin-1-yl)carbothioylphenoxy]-N-...)
Affinity DataIC50:  3.35E+3nM. Assay description: Data Source: Sanford-Burnham Center for Chemical Genomics (SBCCG) Source Affiliation: Sanford-Burnham Medical Research Institute (SBMRI, San Diego, C...
In DepthDetails PCBioAssay
TargetDual specificity protein phosphatase 3(Homo sapiens (Human))
Burnham Center For Chemical Genomics
Curated by PubChem BioAssay
LigandPNGBDBM88756(2-[4-(4-ethylpiperazin-1-yl)carbothioylphenoxy]-N-...)
Affinity DataIC50:  1.92E+3nM. Assay description: Data Source: Sanford-Burnham Center for Chemical Genomics (SBCCG) Source Affiliation: Sanford-Burnham Medical Research Institute (SBMRI, San Diego, C...
In DepthDetails PCBioAssay