BDBM88782 (4E)-5-(4-bromophenyl)-4-[(4-bromophenyl)-hydroxy-methylene]-1-(3-hydroxypropyl)pyrrolidine-2,3-quinone::(4E)-5-(4-bromophenyl)-4-[(4-bromophenyl)-hydroxymethylidene]-1-(3-hydroxypropyl)pyrrolidine-2,3-dione::(4E)-5-(4-bromophenyl)-4-[(4-bromophenyl)-oxidanyl-methylidene]-1-(3-oxidanylpropyl)pyrrolidine-2,3-dione::4-(4-Bromo-benzoyl)-5-(4-bromo-phenyl)-3-hydroxy-1-(3-hydroxy-propyl)-1,5-dihydro-pyrrol-2-one::MLS001213090::SMR000514625::cid_5911387
SMILES OCCCN1C(C(C(=O)c2ccc(Br)cc2)C(=O)C1=O)c1ccc(Br)cc1
InChI Key InChIKey=HACRXUWYOKRPRP-UHFFFAOYSA-N
Data  4 IC50
  Tab Delimited (TSV)   2D SDfile   Computed 3D by Vconf -m prep SDfile
Find this compound or compounds like it in BindingDB:
Activity Spreadsheet -- Enzyme Inhibition Constant Data from BindingDB
Found 4 hits for monomerid = 88782
TargetTyrosine-protein phosphatase non-receptor type 5(Homo sapiens (Human))
Burnham Center For Chemical Genomics
Curated by PubChem BioAssay
LigandPNGBDBM88782((4E)-5-(4-bromophenyl)-4-[(4-bromophenyl)-hydroxy-...)
Affinity DataIC50:  3.62E+4nM. Assay description: Data Source: Sanford-Burnham Center for Chemical Genomics (SBCCG) Source Affiliation: Sanford-Burnham Medical Research Institute (SBMRI, San Diego, C...
In DepthDetails PCBioAssay
TargetTyrosine-protein phosphatase non-receptor type 5(Homo sapiens (Human))
Burnham Center For Chemical Genomics
Curated by PubChem BioAssay
LigandPNGBDBM88782((4E)-5-(4-bromophenyl)-4-[(4-bromophenyl)-hydroxy-...)
Affinity DataIC50:  4.15E+4nM. Assay description: Data Source: Sanford-Burnham Center for Chemical Genomics (SBCCG) Source Affiliation: Sanford-Burnham Medical Research Institute (SBMRI, San Diego, C...
In DepthDetails PCBioAssay
TargetTyrosine-protein phosphatase non-receptor type 11(Homo sapiens (Human))
Burnham Center For Chemical Genomics
Curated by PubChem BioAssay
LigandPNGBDBM88782((4E)-5-(4-bromophenyl)-4-[(4-bromophenyl)-hydroxy-...)
Affinity DataIC50:  5.89E+4nM. Assay description: Data Source: Sanford-Burnham Center for Chemical Genomics (SBCCG) Source Affiliation: Sanford-Burnham Medical Research Institute (SBMRI, San Diego, C...
In DepthDetails PCBioAssay
TargetDual specificity protein phosphatase 3(Homo sapiens (Human))
Burnham Center For Chemical Genomics
Curated by PubChem BioAssay
LigandPNGBDBM88782((4E)-5-(4-bromophenyl)-4-[(4-bromophenyl)-hydroxy-...)
Affinity DataIC50:  7.34E+4nM. Assay description: Data Source: Sanford-Burnham Center for Chemical Genomics (SBCCG) Source Affiliation: Sanford-Burnham Medical Research Institute (SBMRI, San Diego, C...
In DepthDetails PCBioAssay