BDBM89038 6-bromanyl-2-(3-chlorophenyl)-3-[(2-methoxyphenyl)methyl]imidazo[1,2-a]pyridine::6-bromo-2-(3-chlorophenyl)-3-[(2-methoxyphenyl)methyl]imidazo[1,2-a]pyridine::6-bromo-2-(3-chlorophenyl)-3-o-anisyl-imidazo[1,2-a]pyridine::MLS003322137::SMR002002152::cid_51360616
SMILES COc1ccccc1Cc1c(nc2ccc(Br)cn12)-c1cccc(Cl)c1
InChI Key InChIKey=PQVPKSOAEMAHQP-UHFFFAOYSA-N
Data  2 IC50
  Tab Delimited (TSV)   2D SDfile   Computed 3D by Vconf -m prep SDfile
Find this compound or compounds like it in BindingDB:
Activity Spreadsheet -- Enzyme Inhibition Constant Data from BindingDB
Found 2 hits for monomerid = 89038
Target26S proteasome non-ATPase regulatory subunit 14(Homo sapiens (Human))
Burnham Center For Chemical Genomics
Curated by PubChem BioAssay
LigandPNGBDBM89038(6-bromanyl-2-(3-chlorophenyl)-3-[(2-methoxyphenyl)...)
Affinity DataIC50:  1.42E+4nM. Assay description: Data Source: Sanford-Burnham Center for Chemical Genomics (SBCCG) Source Affiliation: Sanford Burnham Medical Research Institute (SBMRI, La Jolla, CA...
In DepthDetails PCBioAssay
TargetProthrombin(Bos taurus (Bovine))
Burnham Center For Chemical Genomics
Curated by PubChem BioAssay
LigandPNGBDBM89038(6-bromanyl-2-(3-chlorophenyl)-3-[(2-methoxyphenyl)...)
Affinity DataIC50:  8.29E+3nM. Assay description: Data Source: Sanford-Burnham Center for Chemical Genomics (SBCCG) Source Affiliation: Sanford Burnham Medical Research Institute (SBMRI, La Jolla, CA...
In DepthDetails PCBioAssay