BDBM89069 1,3-benzothiazole-6-carboxylic acid [(Z)-[amino-(2,4-dichlorophenyl)methylene]amino] ester::1,3-benzothiazole-6-carboxylic acid [(Z)-[amino-(2,4-dichlorophenyl)methylidene]amino] ester::MLS-0454738.0001::[(Z)-[amino-(2,4-dichlorophenyl)methylidene]amino] 1,3-benzothiazole-6-carboxylate::[(Z)-[azanyl-(2,4-dichlorophenyl)methylidene]amino] 1,3-benzothiazole-6-carboxylate::cid_9584423
SMILES NC(=NOC(=O)c1ccc2ncsc2c1)c1ccc(Cl)cc1Cl
InChI Key InChIKey=WOLCAJVNDVWFDZ-UHFFFAOYSA-N
Data  3 IC50
  Tab Delimited (TSV)   2D SDfile   Computed 3D by Vconf -m prep SDfile
Find this compound or compounds like it in BindingDB:
Activity Spreadsheet -- Enzyme Inhibition Constant Data from BindingDB
Found 3 hits for monomerid = 89069
TargetMitochondrial import inner membrane translocase subunit TIM23(Saccharomyces cerevisiae S288c)
Burnham Center For Chemical Genomics
Curated by PubChem BioAssay
LigandPNGBDBM89069(1,3-benzothiazole-6-carboxylic acid [(Z)-[amino-(2...)
Affinity DataIC50:  1.48E+3nM. Assay description: Data Source: Sanford-Burnham Center for Chemical Genomics (SBCCG) Source Affiliation: Sanford-Burnham Medical Research Institute(SBMRI, San Diego, CA...
In DepthDetails PCBioAssay
TargetMitochondrial import inner membrane translocase subunit TIM10(Saccharomyces cerevisiae S288c)
Burnham Center For Chemical Genomics
Curated by PubChem BioAssay
LigandPNGBDBM89069(1,3-benzothiazole-6-carboxylic acid [(Z)-[amino-(2...)
Affinity DataIC50:  2.57E+3nM. Assay description: Data Source: Sanford-Burnham Center for Chemical Genomics (SBCCG) Source Affiliation: Sanford-Burnham Medical Research Institute(SBMRI, San Diego, CA...
In DepthDetails PCBioAssay
TargetMitochondrial import inner membrane translocase subunit TIM10(Saccharomyces cerevisiae S288c)
Burnham Center For Chemical Genomics
Curated by PubChem BioAssay
LigandPNGBDBM89069(1,3-benzothiazole-6-carboxylic acid [(Z)-[amino-(2...)
Affinity DataIC50:  5.07E+4nM. Assay description: Data Source: Sanford-Burnham Center for Chemical Genomics (SBCCG) Source Affiliation: Sanford-Burnham Medical Research Institute(SBMRI, San Diego, CA...
In DepthDetails PCBioAssay