BDBM89076 3,7-dimethyl-5-oxidanylidene-N-phenyl-[1,3]thiazolo[3,2-a]pyrimidine-6-sulfonamide::3,7-dimethyl-5-oxo-N-phenyl-6-thiazolo[3,2-a]pyrimidinesulfonamide::3,7-dimethyl-5-oxo-N-phenyl-[1,3]thiazolo[3,2-a]pyrimidine-6-sulfonamide::5-keto-3,7-dimethyl-N-phenyl-thiazolo[3,2-a]pyrimidine-6-sulfonamide::MLS-0463347.0001::cid_22432635
SMILES Cc1csc2nc(C)c(c(=O)n12)S(=O)(=O)Nc1ccccc1
InChI Key InChIKey=JQYJLCRLWMUESC-UHFFFAOYSA-N
Data  3 IC50
  Tab Delimited (TSV)   2D SDfile   Computed 3D by Vconf -m prep SDfile
Find this compound or compounds like it in BindingDB:
Activity Spreadsheet -- Enzyme Inhibition Constant Data from BindingDB
Found 3 hits for monomerid = 89076
TargetMitochondrial import inner membrane translocase subunit TIM23(Saccharomyces cerevisiae S288c)
Burnham Center For Chemical Genomics
Curated by PubChem BioAssay
LigandPNGBDBM89076(3,7-dimethyl-5-oxidanylidene-N-phenyl-[1,3]thiazol...)
Affinity DataIC50: >9.90E+4nM. Assay description: Data Source: Sanford-Burnham Center for Chemical Genomics (SBCCG) Source Affiliation: Sanford-Burnham Medical Research Institute(SBMRI, San Diego, CA...
In DepthDetails PCBioAssay
TargetMitochondrial import inner membrane translocase subunit TIM10(Saccharomyces cerevisiae S288c)
Burnham Center For Chemical Genomics
Curated by PubChem BioAssay
LigandPNGBDBM89076(3,7-dimethyl-5-oxidanylidene-N-phenyl-[1,3]thiazol...)
Affinity DataIC50:  8.45E+4nM. Assay description: Data Source: Sanford-Burnham Center for Chemical Genomics (SBCCG) Source Affiliation: Sanford-Burnham Medical Research Institute(SBMRI, San Diego, CA...
In DepthDetails PCBioAssay
TargetMitochondrial import inner membrane translocase subunit TIM10(Saccharomyces cerevisiae S288c)
Burnham Center For Chemical Genomics
Curated by PubChem BioAssay
LigandPNGBDBM89076(3,7-dimethyl-5-oxidanylidene-N-phenyl-[1,3]thiazol...)
Affinity DataIC50:  6.69E+4nM. Assay description: Data Source: Sanford-Burnham Center for Chemical Genomics (SBCCG) Source Affiliation: Sanford-Burnham Medical Research Institute(SBMRI, San Diego, CA...
In DepthDetails PCBioAssay