BDBM89098 7-methyl-2-[(5-pyrrolidin-1-ylsulfonylpyridin-2-yl)sulfanylmethyl]pyrido[1,2-a]pyrimidin-4-one::7-methyl-2-[[(5-pyrrolidinosulfonyl-2-pyridyl)thio]methyl]pyrido[1,2-a]pyrimidin-4-one::7-methyl-2-[[[5-(1-pyrrolidinylsulfonyl)-2-pyridinyl]thio]methyl]-4-pyrido[1,2-a]pyrimidinone::MLS-0463366.0001::cid_16261026
SMILES Cc1ccc2nc(CSc3ccc(cn3)S(=O)(=O)N3CCCC3)cc(=O)n2c1
InChI Key InChIKey=LLYVZNBWPKVDNQ-UHFFFAOYSA-N
Data  3 IC50
  Tab Delimited (TSV)   2D SDfile   Computed 3D by Vconf -m prep SDfile
Find this compound or compounds like it in BindingDB:
Activity Spreadsheet -- Enzyme Inhibition Constant Data from BindingDB
Found 3 hits for monomerid = 89098
TargetMitochondrial import inner membrane translocase subunit TIM23(Saccharomyces cerevisiae S288c)
Burnham Center For Chemical Genomics
Curated by PubChem BioAssay
LigandPNGBDBM89098(7-methyl-2-[(5-pyrrolidin-1-ylsulfonylpyridin-2-yl...)
Affinity DataIC50: >9.90E+4nM. Assay description: Data Source: Sanford-Burnham Center for Chemical Genomics (SBCCG) Source Affiliation: Sanford-Burnham Medical Research Institute(SBMRI, San Diego, CA...
In DepthDetails PCBioAssay
TargetMitochondrial import inner membrane translocase subunit TIM10(Saccharomyces cerevisiae S288c)
Burnham Center For Chemical Genomics
Curated by PubChem BioAssay
LigandPNGBDBM89098(7-methyl-2-[(5-pyrrolidin-1-ylsulfonylpyridin-2-yl...)
Affinity DataIC50:  6.47E+4nM. Assay description: Data Source: Sanford-Burnham Center for Chemical Genomics (SBCCG) Source Affiliation: Sanford-Burnham Medical Research Institute(SBMRI, San Diego, CA...
In DepthDetails PCBioAssay
TargetMitochondrial import inner membrane translocase subunit TIM10(Saccharomyces cerevisiae S288c)
Burnham Center For Chemical Genomics
Curated by PubChem BioAssay
LigandPNGBDBM89098(7-methyl-2-[(5-pyrrolidin-1-ylsulfonylpyridin-2-yl...)
Affinity DataIC50: >9.90E+4nM. Assay description: Data Source: Sanford-Burnham Center for Chemical Genomics (SBCCG) Source Affiliation: Sanford-Burnham Medical Research Institute(SBMRI, San Diego, CA...
In DepthDetails PCBioAssay