BDBM89138 4-[(3-cyano-4,5,6,7-tetrahydro-1-benzothiophen-2-yl)amino]-4-oxobutanoic acid methyl ester::4-[(3-cyano-4,5,6,7-tetrahydrobenzothiophen-2-yl)amino]-4-keto-butyric acid methyl ester::MLS000034111::N-(3-Cyano-4,5,6,7-tetrahydro-benzo[b]thiophen-2-yl)-succinamic acid methyl ester::SMR000009406::cid_647543::methyl 4-[(3-cyano-4,5,6,7-tetrahydro-1-benzothiophen-2-yl)amino]-4-oxidanylidene-butanoate::methyl 4-[(3-cyano-4,5,6,7-tetrahydro-1-benzothiophen-2-yl)amino]-4-oxobutanoate
SMILES COC(=O)CCC(=O)Nc1sc2CCCCc2c1C#N
InChI Key InChIKey=DTDOPKJMXYAOGA-UHFFFAOYSA-N
Data  1 EC50
  Tab Delimited (TSV)   2D SDfile   Computed 3D by Vconf -m prep SDfile
Find this compound or compounds like it in BindingDB:
Activity Spreadsheet -- Enzyme Inhibition Constant Data from BindingDB
Found 1 hit for monomerid = 89138
TargetHigh affinity choline transporter 1(Homo sapiens (Human))
Johns Hopkins Ion Channel Center
Curated by PubChem BioAssay
LigandPNGBDBM89138(4-[(3-cyano-4,5,6,7-tetrahydro-1-benzothiophen-2-y...)
Affinity DataEC50:  1.40E+4nM. Assay description: Data Source (MLPCN Center Name): Johns Hopkins Ion Channel Center (JHICC) Center Affiliation: Johns Hopkins University, School of Medicine Screening ...
In DepthDetails PCBioAssay