BDBM89170 (2-methoxy-5-methyl-phenyl)-[5-[4-(methylthio)phenyl]-4-phenyl-1,3,4-thiadiazol-4-ium-2-yl]amine;chloride::MLS000948481::N-(2-methoxy-5-methyl-phenyl)-5-(4-methylsulfanylphenyl)-4-phenyl-1,3,4-thiadiazol-4-ium-2-amine;chloride::N-(2-methoxy-5-methylphenyl)-5-(4-methylsulfanylphenyl)-4-phenyl-1,3,4-thiadiazol-4-ium-2-amine;chloride::N-(2-methoxy-5-methylphenyl)-5-[4-(methylthio)phenyl]-4-phenyl-1,3,4-thiadiazol-4-ium-2-amine;chloride::SMR000526897::cid_24789724
SMILES COc1ccc(C)cc1Nc1n[n+](c(s1)-c1ccc(SC)cc1)-c1ccccc1
InChI Key InChIKey=QFNWPCFRUXTJSM-UHFFFAOYSA-N
Data  1 EC50
  Tab Delimited (TSV)   2D SDfile   Computed 3D by Vconf -m prep SDfile
Find this compound or compounds like it in BindingDB:
Activity Spreadsheet -- Enzyme Inhibition Constant Data from BindingDB
Found 1 hit for monomerid = 89170
TargetHigh affinity choline transporter 1(Homo sapiens (Human))
Johns Hopkins Ion Channel Center
Curated by PubChem BioAssay
LigandPNGBDBM89170((2-methoxy-5-methyl-phenyl)-[5-[4-(methylthio)phen...)
Affinity DataEC50:  1.55E+4nM. Assay description: Data Source (MLPCN Center Name): Johns Hopkins Ion Channel Center (JHICC) Center Affiliation: Johns Hopkins University, School of Medicine Screening ...
In DepthDetails PCBioAssay