BDBM89194 4-[2-[(Z)-[(5-bromanyl-1-benzofuran-2-yl)carbonylhydrazinylidene]methyl]pyrrol-1-yl]benzoic acid::4-[2-[(Z)-[(5-bromo-1-benzofuran-2-carbonyl)hydrazinylidene]methyl]pyrrol-1-yl]benzoic acid::4-[2-[(Z)-[(5-bromobenzofuran-2-carbonyl)hydrazono]methyl]pyrrol-1-yl]benzoic acid::4-[2-[(Z)-[[(5-bromo-2-benzofuranyl)-oxomethyl]hydrazinylidene]methyl]-1-pyrrolyl]benzoic acid::4-{2-[(5-Bromo-benzofuran-2-carbonyl)-hydrazonomethyl]-pyrrol-1-yl}-benzoic acid::MLS001043301::SMR000414988::cid_5431119
SMILES OC(=O)c1ccc(cc1)-n1cccc1\C=N/NC(=O)c1cc2cc(Br)ccc2o1
InChI Key InChIKey=SIFPICQLVICEFD-FMCGGJTJSA-N
Data  1 IC50
  Tab Delimited (TSV)   2D SDfile   Computed 3D by Vconf -m prep SDfile
Find this compound or compounds like it in BindingDB:
Activity Spreadsheet -- Enzyme Inhibition Constant Data from BindingDB
Found 1 hit for monomerid = 89194
TargetDNA (cytosine-5)-methyltransferase 1(Homo sapiens (Human))
Burnham Center For Chemical Genomics
Curated by PubChem BioAssay
LigandPNGBDBM89194(4-[2-[(Z)-[(5-bromanyl-1-benzofuran-2-yl)carbonylh...)
Affinity DataIC50:  4.36E+3nM. Assay description: Data Source: Sanford-Burnham Center for Chemical Genomics (SBCCG) Source Affiliation: Sanford-Burnham Medical Research Institute (SBMRI, San Diego, C...
In DepthDetails PCBioAssay