BDBM89438 4-[11-[[2-[4-[5-(tert-butoxycarbonylamino)pentyl]triazol-1-yl]acetyl]amino]undecanoyl]piperazine-1-carboxylic acid tert-butyl ester::4-[11-[[2-[4-[5-[[(2-methylpropan-2-yl)oxy-oxomethyl]amino]pentyl]-1-triazolyl]-1-oxoethyl]amino]-1-oxoundecyl]-1-piperazinecarboxylic acid tert-butyl ester::Boc-KG::MLS002153743::SMR001231169::cid_24983077::tert-butyl 4-[11-[2-[4-[5-[(2-methylpropan-2-yl)oxycarbonylamino]pentyl]-1,2,3-triazol-1-yl]ethanoylamino]undecanoyl]piperazine-1-carboxylate::tert-butyl 4-[11-[[2-[4-[5-[(2-methylpropan-2-yl)oxycarbonylamino]pentyl]triazol-1-yl]acetyl]amino]undecanoyl]piperazine-1-carboxylate
SMILES CC(C)(C)OC(=O)NCCCCCc1cn(CC(=O)NCCCCCCCCCCC(=O)N2CCN(CC2)C(=O)OC(C)(C)C)nn1
InChI Key InChIKey=VEAINKGCOOPOTQ-UHFFFAOYSA-N
Data  2 IC50
  Tab Delimited (TSV)   2D SDfile   Computed 3D by Vconf -m prep SDfile
Find this compound or compounds like it in BindingDB:
Activity Spreadsheet -- Enzyme Inhibition Constant Data from BindingDB
Found 2 hits for monomerid = 89438
TargetProtein Wnt-3a(Mus musculus)
Burnham Center For Chemical Genomics
Curated by PubChem BioAssay
LigandPNGBDBM89438(4-[11-[[2-[4-[5-(tert-butoxycarbonylamino)pentyl]t...)
Affinity DataIC50:  2.19E+4nM
In DepthDetails PCBioAssay
TargetZinc finger protein GLI1(Mus musculus)
Burnham Center For Chemical Genomics
Curated by PubChem BioAssay
LigandPNGBDBM89438(4-[11-[[2-[4-[5-(tert-butoxycarbonylamino)pentyl]t...)
Affinity DataIC50:  2.93E+3nM. Assay description: Data Source: Sanford-Burnham Center for Chemical Genomics (SBCCG) Source Affiliation: Sanford-Burnham Medical Research Institute (SBMRI, San Diego, C...
In DepthDetails PCBioAssay