BDBM89491 2-methyl-3-(1-pyrazolyl)propanoic acid::2-methyl-3-pyrazol-1-yl-propanoic acid::2-methyl-3-pyrazol-1-yl-propionic acid::2-methyl-3-pyrazol-1-ylpropanoic acid::MLS-0466807.0001::cid_6483897
SMILES CC(Cn1cccn1)C(O)=O
InChI Key InChIKey=FWIFKSTVTRTEQU-UHFFFAOYSA-N
Data  2 EC50
  Tab Delimited (TSV)   2D SDfile   Computed 3D by Vconf -m prep SDfile
Find this compound or compounds like it in BindingDB:
Activity Spreadsheet -- Enzyme Inhibition Constant Data from BindingDB
Found 2 hits for monomerid = 89491
TargetCaspase-9(Homo sapiens (Human))
Burnham Center For Chemical Genomics
Curated by PubChem BioAssay
LigandPNGBDBM89491(2-methyl-3-(1-pyrazolyl)propanoic acid | 2-methyl-...)
Affinity DataEC50: >1.00E+5nM. Assay description: Data Source: Sanford-Burnham Center for Chemical Genomics (SBCCG) Source Affiliation: Sanford-Burnham Medical Research Institute (SBIMR, San Diego, C...
In DepthDetails PCBioAssay
TargetApoptotic protease-activating factor 1(Homo sapiens (Human))
Burnham Center For Chemical Genomics
Curated by PubChem BioAssay
LigandPNGBDBM89491(2-methyl-3-(1-pyrazolyl)propanoic acid | 2-methyl-...)
Affinity DataEC50: >1.00E+5nM. Assay description: Data Source: Sanford-Burnham Center for Chemical Genomics (SBCCG) Source Affiliation: Sanford-Burnham Medical Research Institute (SBIMR, San Diego, C...
In DepthDetails PCBioAssay