BDBM89498 2-methyl-3-(1-piperidinyl)propanoic acid::2-methyl-3-piperidin-1-yl-propanoic acid::2-methyl-3-piperidin-1-ylpropanoic acid::2-methyl-3-piperidino-propionic acid::MLS-0466812.0001::cid_4739598
SMILES CC(CN1CCCCC1)C(O)=O
InChI Key InChIKey=FNXJEHJSDJHSFC-UHFFFAOYSA-N
Data  2 EC50
  Tab Delimited (TSV)   2D SDfile   Computed 3D by Vconf -m prep SDfile
Find this compound or compounds like it in BindingDB:
Activity Spreadsheet -- Enzyme Inhibition Constant Data from BindingDB
Found 2 hits for monomerid = 89498
TargetCaspase-9(Homo sapiens (Human))
Burnham Center For Chemical Genomics
Curated by PubChem BioAssay
LigandPNGBDBM89498(2-methyl-3-(1-piperidinyl)propanoic acid | 2-methy...)
Affinity DataEC50: >1.00E+5nM. Assay description: Data Source: Sanford-Burnham Center for Chemical Genomics (SBCCG) Source Affiliation: Sanford-Burnham Medical Research Institute (SBIMR, San Diego, C...
In DepthDetails PCBioAssay
TargetApoptotic protease-activating factor 1(Homo sapiens (Human))
Burnham Center For Chemical Genomics
Curated by PubChem BioAssay
LigandPNGBDBM89498(2-methyl-3-(1-piperidinyl)propanoic acid | 2-methy...)
Affinity DataEC50: >1.00E+5nM. Assay description: Data Source: Sanford-Burnham Center for Chemical Genomics (SBCCG) Source Affiliation: Sanford-Burnham Medical Research Institute (SBIMR, San Diego, C...
In DepthDetails PCBioAssay