BDBM89714 1-(4-methoxyphenyl)sulfonyl-N-(4-pyridylmethyl)nipecotamide::1-(4-methoxyphenyl)sulfonyl-N-(pyridin-4-ylmethyl)-3-piperidinecarboxamide::1-(4-methoxyphenyl)sulfonyl-N-(pyridin-4-ylmethyl)piperidine-3-carboxamide::1-[(4-methoxyphenyl)sulfonyl]-N-(4-pyridinylmethyl)-3-piperidinecarboxamide::MLS000100299::SMR000082372::cid_2981499
SMILES COc1ccc(cc1)S(=O)(=O)N1CCCC(C1)C(=O)NCc1ccncc1
InChI Key InChIKey=VNVHJAKKRMKQKL-UHFFFAOYSA-N
Data  1 EC50
  Tab Delimited (TSV)   2D SDfile   Computed 3D by Vconf -m prep SDfile
Find this compound or compounds like it in BindingDB:
Activity Spreadsheet -- Enzyme Inhibition Constant Data from BindingDB
Found 1 hit for monomerid = 89714
TargetCorticotropin-releasing factor-binding protein(Homo sapiens (Human))
Burnham Center For Chemical Genomics
Curated by PubChem BioAssay
LigandPNGBDBM89714(1-(4-methoxyphenyl)sulfonyl-N-(4-pyridylmethyl)nip...)
Affinity DataEC50: >5.30E+4nM. Assay description: Data Source: Sanford-Burnham Center for Chemical Genomics (SBCCG) Source Affiliation: Sanford-Burnham Medical Research Institute (SBMRI, San Diego, C...
In DepthDetails PCBioAssay