BDBM90066 (E)-2,3-diphenyl-N-(2,4,6-trimethylphenyl)-2-propenamide::(E)-2,3-diphenyl-N-(2,4,6-trimethylphenyl)prop-2-enamide::(E)-N-mesityl-2,3-diphenyl-acrylamide::MLS000578385::N-mesityl-2,3-diphenylacrylamide::SMR000198286::cid_2165690
SMILES Cc1cc(C)c(NC(=O)C(=C\c2ccccc2)\c2ccccc2)c(C)c1
InChI Key InChIKey=SNBJEAZJJBSTDU-CJLVFECKSA-N
Data  1 IC50  1 EC50
  Tab Delimited (TSV)   2D SDfile   Computed 3D by Vconf -m prep SDfile
Find this compound or compounds like it in BindingDB:
Activity Spreadsheet -- Enzyme Inhibition Constant Data from BindingDB
Found 2 hits for monomerid = 90066
TargetCorticotropin-releasing factor-binding protein(Homo sapiens (Human))
Burnham Center For Chemical Genomics
Curated by PubChem BioAssay
LigandPNGBDBM90066((E)-2,3-diphenyl-N-(2,4,6-trimethylphenyl)-2-prope...)
Affinity DataIC50:  2.00E+4nM
In DepthDetails PCBioAssay
TargetCorticotropin-releasing factor-binding protein(Homo sapiens (Human))
Burnham Center For Chemical Genomics
Curated by PubChem BioAssay
LigandPNGBDBM90066((E)-2,3-diphenyl-N-(2,4,6-trimethylphenyl)-2-prope...)
Affinity DataEC50: >5.30E+4nM. Assay description: Data Source: Sanford-Burnham Center for Chemical Genomics (SBCCG) Source Affiliation: Sanford-Burnham Medical Research Institute (SBMRI, San Diego, C...
In DepthDetails PCBioAssay