BDBM90473 MLS000687443::N-[(3-methoxyphenyl)methyl]-2-methyl-4-nitro-aniline::N-[(3-methoxyphenyl)methyl]-2-methyl-4-nitroaniline::SMR000283460::cid_2850298::m-anisyl-(2-methyl-4-nitro-phenyl)amine
SMILES COc1cccc(CNc2ccc(cc2C)[N+]([O-])=O)c1
InChI Key InChIKey=PUGDKZBPMHPDOZ-UHFFFAOYSA-N
Data  3 IC50  1 EC50
  Tab Delimited (TSV)   2D SDfile   Computed 3D by Vconf -m prep SDfile
Find this compound or compounds like it in BindingDB:
Activity Spreadsheet -- Enzyme Inhibition Constant Data from BindingDB
Found 4 hits for monomerid = 90473
TargetCorticotropin-releasing factor-binding protein(Homo sapiens (Human))
Burnham Center For Chemical Genomics
Curated by PubChem BioAssay
LigandPNGBDBM90473(MLS000687443 | N-[(3-methoxyphenyl)methyl]-2-methy...)
Affinity DataEC50: >5.30E+4nM. Assay description: Data Source: Sanford-Burnham Center for Chemical Genomics (SBCCG) Source Affiliation: Sanford-Burnham Medical Research Institute (SBMRI, San Diego, C...
In DepthDetails PCBioAssay
TargetDisintegrin and metalloproteinase domain-containing protein 17(Homo sapiens (Human))
The Scripps Research Institute Molecular Screening Center
Curated by PubChem BioAssay
LigandPNGBDBM90473(MLS000687443 | N-[(3-methoxyphenyl)methyl]-2-methy...)
Affinity DataIC50:  6.95E+4nM. Assay description: Source (MLPCN Center Name): The Scripps Research Institute Molecular Screening Center (SRIMSC) Center Affiliation: Torrey Pines Institute for Molecul...
In DepthDetails PCBioAssay
TargetDisintegrin and metalloproteinase domain-containing protein 10(Homo sapiens (Human))
The Scripps Research Institute Molecular Screening Center
Curated by PubChem BioAssay
LigandPNGBDBM90473(MLS000687443 | N-[(3-methoxyphenyl)methyl]-2-methy...)
Affinity DataIC50:  2.74E+4nM. Assay description: Source (MLPCN Center Name): The Scripps Research Institute Molecular Screening Center (SRIMSC) Center Affiliation: Torrey Pines Institute for Molecul...
In DepthDetails PCBioAssay
TargetCorticotropin-releasing factor-binding protein(Homo sapiens (Human))
Burnham Center For Chemical Genomics
Curated by PubChem BioAssay
LigandPNGBDBM90473(MLS000687443 | N-[(3-methoxyphenyl)methyl]-2-methy...)
Affinity DataIC50:  2.00E+4nM
In DepthDetails PCBioAssay